program: Gaussian 09
title: 000005440
version: EM64L-G09RevD.01
frameworkgroup: C1[X(C22H29N3S2)]
method: RPBEPBE
basis: SDD
operation: Freq
keyword: #p
keyword: freq=noraman
keyword: PBEPBE/SDD
title: #p freq=noraman PBEPBE/SDD
converged: YES YES NO NO
title: Mulliken charges:
elementType: S S N N N C C C C C C C C C C C C C C C C C C C C C C H H H H H H H H H H H H H H H H H H H H H H H H H H H H H
charge: 0.232482 0.174303 -0.084826 -0.062106 -0.291589 -0.360320 -0.351209 -0.312556 -0.379107 -0.386112 -0.430656 -0.427123 -0.614336 0.535295 0.476873 -0.390418 -0.346800 -0.299667 -0.335042 -0.263371 -0.208425 -0.267511 -0.299347 -0.238582 -0.252285 -0.623673 -0.613580 0.189132 0.202486 0.199833 0.193764 0.212341 0.192423 0.204683 0.183939 0.182675 0.204851 0.221978 0.236101 0.222719 0.217415 0.221997 0.185737 0.222318 0.275465 0.245359 0.249998 0.247515 0.260366 0.227947 0.232508 0.250382 0.252989 0.238875 0.231234 0.212659
chargesum: 0.00000
title: Mulliken charges with hydrogens summed into heavy atoms:
elementType: S S N N N C C C C C C C C C C C C C C C C C C C C C C
charge: 0.232482 0.174303 -0.084826 -0.062106 -0.291589 0.031299 0.042388 0.092208 0.009516 0.001414 0.027423 0.013011 0.015715 0.535295 0.476873 -0.390418 -0.346800 -0.024202 -0.089683 -0.013373 -0.208425 -0.019996 -0.038981 -0.010635 -0.019777 -0.120302 0.069188
polarizability: 3.15931825e+02 -7.82200491e+01 3.24307985e+02 5.34745407e+00 8.16450799e+00 2.56801226e+02
1716.lowfreq: -17.2534 -8.5531 -7.2363 -6.3167 -0.0013 -0.0012 0.0004 10.5346 12.4084
frequency: -16.7908 10.3418 12.0241 16.5931 34.4045 47.1355 51.8583 80.5876 85.9697 110.5635 115.7182 126.5410 148.6622 169.1748 211.5788 217.4041 226.0166 229.0896 243.2892 249.3235 255.1691 281.3291 293.8078 310.4751 321.9370 332.5709 336.9949 337.7742 372.7593 378.0130 395.6318 406.3437 414.3333 430.6719 444.4100 472.7101 486.5015 491.7266 521.4062 544.1110 571.9688 590.5420 598.4269 610.5482 627.1477 665.4678 681.7007 716.3748 726.1408 747.8280 750.9902 755.3347 764.0341 774.3469 799.4723 822.3690 845.1161 847.1242 865.4306 870.8143 907.7161 926.8808 928.4972 945.6038 963.2617 972.2632 980.5126 1006.9009 1020.5294 1024.3288 1033.5499 1041.0685 1042.7078 1047.4208 1057.7057 1064.2543 1074.9720 1086.1316 1091.7892 1098.5838 1103.4064 1121.3163 1126.6916 1138.6403 1143.5466 1147.2431 1150.9044 1174.3516 1189.6168 1194.0161 1222.8034 1236.0653 1244.2103 1252.2248 1255.9303 1267.5753 1274.9683 1279.5820 1280.3481 1298.3056 1303.6774 1312.2066 1324.6076 1336.7036 1352.7901 1354.4713 1365.5722 1369.1194 1371.7058 1380.3475 1388.6728 1393.4324 1398.9730 1427.3051 1428.7724 1444.4576 1450.6836 1451.3324 1453.2702 1458.7004 1461.1037 1462.2859 1465.3443 1472.9960 1473.4021 1479.3374 1480.4708 1484.2102 1488.1408 1557.0734 1571.3038 1578.4342 1605.4534 2842.2906 2844.4451 2860.0594 2866.2312 2871.9929 2883.3504 2940.5118 2974.9277 3001.9388 3002.9793 3015.9335 3016.1539 3022.0023 3025.2575 3029.0443 3039.4995 3050.9276 3066.2684 3068.9176 3074.3175 3076.4472 3101.9429 3132.3579 3142.0351 3143.7327 3151.7596 3155.7925 3169.7074 3170.4299
redmass: 2.8027 4.1772 4.8335 4.6327 4.5330 3.7953 3.6467 3.8784 3.2075 3.3234 3.7283 4.8668 2.8238 2.8573 4.4555 1.3106 2.8591 1.6689 2.2467 2.1058 2.1226 3.7250 5.8549 2.4844 3.5062 4.3567 4.1354 2.2717 2.5168 5.6300 5.3594 2.4368 3.8547 4.9846 3.1800 4.9530 3.0925 3.9045 4.0618 3.9296 5.9650 5.0340 5.0893 2.5107 3.4576 5.8621 6.0836 4.3097 3.6041 2.3809 2.1004 1.8921 1.2736 2.6030 1.8325 1.3289 1.5309 1.3893 1.7735 1.6515 3.6304 2.2577 1.3858 1.3439 2.0978 1.3298 1.6689 2.3637 5.8370 2.7560 4.7283 1.3280 2.2811 1.6245 1.7971 2.3288 1.9348 2.3756 2.3446 2.7155 1.9294 1.8191 1.6233 2.3019 1.4641 2.4875 2.9411 1.0670 1.4625 1.0792 1.5019 1.9479 1.2084 1.7961 1.5073 1.2480 1.3817 1.7562 1.6487 1.2952 1.3129 1.8256 1.3138 1.2890 1.4227 1.4559 9.1752 1.4432 1.4086 8.3936 1.2109 1.6879 2.1283 1.1710 2.3366 1.0943 1.0825 1.0826 2.6194 1.0795 1.0578 1.0626 1.0915 1.1212 2.2384 1.0488 1.0535 1.0970 1.1786 6.7416 7.2360 6.7549 7.0752 1.0686 1.0645 1.0649 1.0699 1.0683 1.0678 1.0697 1.0370 1.0845 1.0658 1.0723 1.0593 1.0886 1.0913 1.0878 1.0886 1.0947 1.0975 1.0972 1.1009 1.1015 1.1039 1.0850 1.0898 1.0887 1.0910 1.0938 1.0965 1.1006
irintensity: 0.0192 0.4736 0.1358 0.4603 0.4174 0.2100 0.2575 0.6755 0.8605 0.7751 1.5070 0.4598 1.6532 0.7159 1.5849 0.1548 0.2184 0.0652 0.5280 1.3904 0.3158 3.3156 1.6120 3.3322 4.9778 1.8023 2.0857 4.3927 0.2772 2.4631 2.9585 1.5109 1.5855 5.3183 0.3596 13.4334 1.8915 5.0886 1.7572 1.9322 10.5210 3.3005 0.2873 0.2728 2.9686 4.5940 2.4081 0.5187 5.9425 37.6281 50.4979 14.0871 20.4991 12.9110 4.7978 35.0615 0.1820 0.7299 9.0458 24.7405 25.7237 4.5193 1.3028 0.4241 7.0712 0.1455 21.9848 41.8467 33.5364 3.4718 5.3383 1.5619 7.6276 3.5332 0.2244 5.8787 2.9022 1.3015 9.4544 11.7406 21.6874 20.1137 23.7512 29.9040 13.5113 37.9211 30.0966 0.5059 8.8075 0.9253 37.5785 41.8354 3.9391 28.4994 10.2315 23.7269 6.4330 2.4720 24.1097 12.8162 6.8223 74.4008 15.1892 3.6135 4.2284 18.4613 25.6135 5.0195 5.8153 10.1256 16.2979 12.4115 17.0136 1.2252 9.0029 9.4117 3.3652 1.5444 324.2132 33.8037 10.6550 12.3125 3.2517 17.3906 35.4886 8.7529 8.5337 8.2124 3.9824 7.8708 56.9986 7.8979 24.5008 68.1955 51.2549 119.4977 20.1641 82.2606 189.6567 52.7218 34.6265 13.1735 24.8325 42.3358 23.8120 29.2332 61.3016 61.1027 35.6934 5.3051 26.3245 58.2783 35.8270 3.7910 49.4166 2.2781 7.3746 3.3932 3.8164 22.3860 5.3885 23.7035
temp: 298.150 k
press: 1.00000 atm
elementType: 16 16 7 7 7 6 6 6 6 6 6 6 6 6 6 6 6 6 6 6 6 6 6 6 6 6 6 1 1 1 1 1 1 1 1 1 1 1 1 1 1 1 1 1 1 1 1 1 1 1 1 1 1 1 1 1
symmnumber: 1
zpe: 1222285.4 jmol-1
zpe.correction: 0.465544 hartree
zpe.thermalcorrener: 0.491570 hartree
zpe.thermalcorrenthalpy: 0.492514 hartree
zpe.thermalcorrgfe: 0.406241 hartree
zpe.sumelectzpe: -1814.064218 hartree
zpe.sumelectthermal: -1814.038191 hartree
zpe.sumelectthermalent: -1814.037247 hartree
zpe.sumelectthermalfe: -1814.123520 hartree
dipole: -1.5073 -1.4964 -1.9358
dipole: 2.8738
quadrupole: -168.7103 -180.2910 -170.8162
quadrupole: -12.2796 -0.2352 5.6630
quadrupole: 4.5622 -7.0185 2.4563 -12.2796 -0.2352 5.6630
hfenergy: -1814.5297615 hartree
pointgroup: C01 [X(C22H29N3S2)]
dipole: 0.5941371 -0.6311425 0.725941 debye
polarizability: 315.5023982|77.7450811|325.4497466|10.0166472|-4.0395034|256.0888908 unknown
InChI: InChI=1S/C22H29N3S2/c1-3-26-18-9-10-22-20(17-18)25(19-7-4-5-8-21(19)27-22)12-6-11-24-15-13-23(2)14-16-24/h4-5,7-10,17H,3,6,11-16H2,1-2H3
charge 0 multiplicity 1
56 atoms
S  -2.301477 -0.507956 -2.238631
S  -0.137122 4.754159 0.88922
N  2.616024 -1.573473 0.542174
N  5.123987 -1.642045 -0.926055
N  -1.662784 -0.330436 0.746918
C  3.126697 -2.831198 -0.063767
C  3.076256 -0.410492 -0.261516
C  1.141301 -1.604075 0.723037
C  4.661751 -2.808153 -0.137037
C  4.611472 -0.382957 -0.337033
C  0.655511 -0.5527 1.742056
C  -0.872867 -0.605366 1.973889
C  6.587442 -1.626186 -1.105217
C  -1.466666 0.899626 0.051365
C  -2.81555 -1.126859 0.460816
C  -1.77734 1.000851 -1.334626
C  -3.275508 -1.26835 -0.878233
C  -0.989821 2.060242 0.715887
C  -3.545318 -1.78433 1.488738
C  -1.618037 2.216377 -2.026349
C  -0.769002 3.261642 0.005906
C  -4.416817 -2.034917 -1.182838
C  -1.084252 3.349427 -1.368124
C  -4.665281 -2.586919 1.179891
C  -5.108433 -2.716778 -0.154609
C  1.596633 4.13452 1.391742
C  2.533386 3.934434 0.194334
H  2.721254 -2.984855 -1.095534
H  2.802577 -3.682765 0.563739
H  2.723833 0.5250 0.209314
H  2.662702 -0.449797 -1.301049
H  0.5995 -1.468208 -0.245662
H  0.873429 -2.611245 1.099782
H  5.021137 -3.732862 -0.627007
H  5.071248 -2.786454 0.906144
H  5.019467 -0.215675 0.693596
H  4.93292 0.462656 -0.974418
H  1.157345 -0.739326 2.710894
H  0.95573 0.45924 1.41755
H  -1.134967 -1.626442 2.300242
H  -1.155049 0.080009 2.802371
H  6.874328 -0.776313 -1.75066
H  7.152002 -1.535002 -0.141696
H  6.911713 -2.557864 -1.603138
H  -0.808829 2.035853 1.794393
H  -3.251195 -1.656102 2.534827
H  -1.880805 2.270714 -3.087938
H  -4.751926 -2.110359 -2.222774
H  -0.911698 4.281906 -1.912826
H  -5.201879 -3.093408 1.989583
H  -5.982218 -3.33047 -0.395601
H  1.460955 3.203419 1.968911
H  1.964015 4.917147 2.078411
H  2.122103 3.188955 -0.50971
H  2.678132 4.880105 -0.356361
H  3.524194 3.575456 0.535781
