program: Gaussian 09
title: 000040700
version: EM64L-G09RevD.01
frameworkgroup: C1[X(C19H30N2O4)]
method: RPBEPBE
basis: SDD
operation: Freq
keyword: #p
keyword: freq=noraman
keyword: PBEPBE/SDD
title: #p freq=noraman PBEPBE/SDD
converged: YES YES NO NO
title: Mulliken charges:
elementType: O O O O N N C C C C C C C C C C C C C C C C C C C H H H H H H H H H H H H H H H H H H H H H H H H H H H H H H
charge: -0.293664 -0.261779 -0.288452 -0.280261 -0.092576 -0.341297 -0.235973 0.448986 -0.007845 0.031685 -0.350404 -0.401040 -0.703532 -0.696549 -0.356007 0.403620 -0.385818 -0.466823 -0.383643 -0.800855 0.176138 0.161016 -0.639891 -0.620558 -0.502976 0.253401 0.187896 0.193016 0.237269 0.236639 0.187648 0.231908 0.219194 0.203552 0.222207 0.224139 0.210125 0.210784 0.268440 0.234231 0.238491 0.230591 0.373200 0.257374 0.222774 0.225181 0.285157 0.209370 0.176975 0.216156 0.184674 0.223629 0.243475 0.244684 0.236316
chargesum: 0.00000
title: Mulliken charges with hydrogens summed into heavy atoms:
elementType: O O O O N N C C C C C C C C C C C C C C C C C C C
charge: -0.293664 -0.261779 -0.288452 -0.280261 -0.092576 0.031903 0.017429 0.448986 -0.007845 0.031685 0.030508 -0.163771 -0.048878 -0.040078 0.068280 0.403620 0.093406 -0.232592 0.085438 -0.095525 0.176138 0.161016 0.031611 0.003901 0.221499
polarizability: 2.85783806e+02 1.72739039e+00 2.77192004e+02 -8.42845543e+00 -2.83879785e+00 1.63306788e+02
1716.lowfreq: -6.0226 0.0002 0.0005 0.0008 3.3556 8.2912 12.8773 16.7775 33.4138
frequency: 11.9307 16.7539 33.3888 42.6003 53.7040 57.5296 66.6009 71.9441 77.2828 83.6962 102.1545 106.2759 115.6408 123.3152 134.8832 158.1103 166.7495 197.4477 202.4955 207.4036 215.5126 221.8786 225.0282 240.0267 241.0999 257.4408 269.0825 271.5699 299.4528 308.8646 314.5240 353.8143 367.3406 383.4553 398.1410 404.8748 405.7819 439.0663 442.0245 490.5937 495.4978 523.8586 573.3669 588.1100 604.8157 634.0243 688.6557 702.0662 726.3407 733.6668 743.4907 792.6949 796.4910 805.4457 823.7311 838.8625 846.4712 882.2606 891.7800 903.1668 923.5940 950.2622 957.1344 957.8691 964.6959 973.9321 981.5298 1022.3845 1038.0850 1041.9569 1047.0882 1063.2109 1071.1037 1076.3312 1090.7077 1093.7384 1097.8907 1111.4980 1114.0325 1138.2893 1148.5037 1159.3700 1166.2221 1177.5558 1190.5356 1213.8609 1217.4216 1255.2898 1265.5188 1270.3239 1272.7913 1286.0843 1302.4403 1302.7096 1332.6786 1338.9752 1340.0690 1343.6193 1364.7289 1365.7041 1378.3830 1397.6950 1398.0927 1402.0511 1419.7180 1423.7773 1440.8328 1447.7625 1452.8673 1457.5825 1461.4248 1463.2429 1464.4978 1465.9392 1466.5349 1467.4050 1469.5789 1470.7482 1476.0809 1477.2659 1480.3422 1483.3868 1485.8605 1488.0987 1546.2742 1569.8659 1596.5817 1607.2860 1628.0712 2834.9061 2848.3598 2871.5797 2974.7218 2975.3944 2978.4004 2989.7328 2992.1097 2999.5507 3005.5259 3010.8912 3015.5723 3024.6680 3029.8547 3049.7902 3067.5670 3068.4446 3074.0505 3074.9639 3077.6662 3079.3366 3082.0876 3084.1816 3084.8551 3090.2653 3108.1250 3122.6043 3146.5685 3151.3405 3388.9568
redmass: 4.2323 4.1758 4.1227 3.0773 3.8690 3.7153 3.5320 3.4963 5.5877 3.3488 3.8264 1.9416 2.1292 3.5688 2.1063 1.0945 3.0405 2.1224 2.2760 2.6941 1.8924 1.6886 1.5767 1.4943 1.3612 1.9716 4.0527 2.2104 4.8513 2.5833 4.2280 3.4983 3.4839 2.8376 2.3379 2.0291 3.1687 4.0536 2.4595 3.3853 3.5973 3.6409 3.8389 4.6582 3.7444 4.1507 4.8918 4.8577 5.8861 5.6315 3.0492 1.1884 4.6430 3.9731 2.8854 1.4710 1.9161 3.2457 4.1009 3.5767 1.2181 5.1181 1.4543 2.3839 1.3663 2.0520 1.9736 2.0686 2.0737 1.4956 1.5655 1.5942 2.3690 1.9630 3.9644 1.4899 2.3784 1.2738 2.7184 1.4348 1.4857 1.5210 1.9898 1.4466 1.1926 1.5613 3.0220 2.5989 2.2373 1.6361 2.4906 2.2457 1.3129 1.8739 1.5698 1.3457 1.4714 1.3709 1.4520 2.5480 1.1945 1.2333 2.2492 1.2436 1.1420 1.3002 1.1423 1.1001 1.0525 1.2559 1.1220 1.1487 1.0594 1.1128 1.4026 1.0667 1.1053 1.0737 1.0829 1.0824 1.0499 1.0493 1.0547 1.1418 1.7035 5.6515 7.9947 8.4239 6.1986 1.0577 1.0589 1.0689 1.0350 1.0600 1.0354 1.0595 1.0364 1.0636 1.0295 1.0706 1.0739 1.0847 1.0967 1.0923 1.0997 1.1005 1.1014 1.0997 1.0990 1.0974 1.1033 1.1002 1.0999 1.1005 1.1046 1.0869 1.0964 1.1048 1.0814
irintensity: 0.1488 0.1202 0.6842 0.8931 3.3970 0.2802 2.7462 1.1992 6.2129 2.2328 1.5444 1.2540 3.9026 0.6342 1.0310 1.0712 6.2309 3.1948 0.5506 2.9542 3.5725 0.0964 1.8789 2.3392 3.3312 2.7301 6.4524 5.0294 2.4047 14.8353 6.7172 13.2286 5.2381 2.8971 2.1422 3.9370 1.7595 0.4315 1.9045 14.0145 0.3783 5.7548 0.6059 1.9533 1.9559 13.0480 11.4593 6.1483 4.0451 1.2740 22.2140 77.7358 15.7893 6.5096 11.7229 22.1388 0.9675 1.2474 12.0663 30.5108 1.8481 42.4963 0.3791 20.7874 1.2673 33.9026 14.6145 54.2389 60.0541 15.2747 4.3691 12.6699 2.3749 7.9959 151.1799 9.4006 19.4475 1.7305 2.7370 6.1813 40.3739 6.3126 33.0379 6.5013 17.8954 74.0709 93.9108 48.4454 30.5414 28.7103 11.1462 21.7082 3.5440 29.5391 9.7162 13.0020 9.3445 2.7633 3.0166 4.5618 15.7674 21.9903 61.8169 4.3336 1.9972 40.5554 10.1073 14.1044 14.6877 30.6368 5.7155 28.1006 15.3142 17.0300 2.9788 0.7838 4.3259 8.3962 29.6249 22.0889 10.6340 22.6873 3.2745 23.4087 179.7460 13.2079 148.8016 247.2133 128.9438 95.7836 144.9342 188.1191 27.0764 45.4002 34.0757 23.8531 27.1892 44.4397 32.9147 42.2218 53.1548 0.4835 34.3147 56.7561 4.9970 37.1703 5.3173 34.0034 72.4644 13.8611 22.8429 15.2630 31.3699 24.0850 22.1686 10.1599 26.5399 15.6874 367.7567
temp: 298.150 k
press: 1.00000 atm
elementType: 8 8 8 8 7 7 6 6 6 6 6 6 6 6 6 6 6 6 6 6 6 6 6 6 6 1 1 1 1 1 1 1 1 1 1 1 1 1 1 1 1 1 1 1 1 1 1 1 1 1 1 1 1 1 1
symmnumber: 1
zpe: 1215964.2 jmol-1
zpe.correction: 0.463136 hartree
zpe.thermalcorrener: 0.491965 hartree
zpe.thermalcorrenthalpy: 0.492909 hartree
zpe.thermalcorrgfe: 0.401226 hartree
zpe.sumelectzpe: -1150.459424 hartree
zpe.sumelectthermal: -1150.430595 hartree
zpe.sumelectthermalent: -1150.429651 hartree
zpe.sumelectthermalfe: -1150.521334 hartree
dipole: -4.5123 -3.2535 1.5716
dipole: 5.7807
quadrupole: -142.3251 -132.2197 -156.0584
quadrupole: -7.1200 7.3614 1.2919
quadrupole: 1.2093 11.3147 -12.5240 -7.1200 7.3614 1.2919
hfenergy: -1150.92256 hartree
pointgroup: C01 [X(C19H30N2O4)]
dipole: -1.5334179 1.6436677 0.3455342 debye
polarizability: 285.3171873|-3.7969149|251.6900114|-0.2595856|48.6474927|189.2754001 unknown
InChI: InChI=1S/C19H30N2O4/c1-13(2)15-9-8-14(3)17(19(23)24-6)18(15)25-12-16(22)20-10-7-11-21(4)5/h8-9,13,20H,7,10-12H2,1-6H3
charge 0 multiplicity 1
55 atoms
O  -0.408491 -0.366539 0.02474
O  -1.275153 3.252511 1.457464
O  2.367754 -2.4326 0.371659
O  0.03647 1.466318 2.111245
N  5.405443 -0.817053 -1.041362
N  2.187072 -0.258947 1.24622
C  -2.403658 -2.061833 -1.31483
C  -2.771147 -0.903773 -0.382871
C  -1.782845 -0.099243 0.245247
C  -2.131935 1.05495 1.017591
C  4.124994 0.948261 0.184068
C  -4.124835 -0.569159 -0.141495
C  -3.048098 -1.882516 -2.715247
C  -2.799759 -3.432623 -0.70124
C  4.284316 0.14909 -1.130751
C  -3.507453 1.382601 1.232439
C  3.626541 0.042037 1.336316
C  -4.483136 0.532531 0.658906
C  0.141778 -1.513952 0.80569
C  -3.969815 2.569357 2.061826
C  1.678263 -1.440152 0.77423
C  -1.027334 1.886167 1.583683
C  5.155324 -2.100062 -1.727792
C  6.710376 -0.225214 -1.38018
C  -0.219693 4.150076 1.989683
H  -1.308329 -2.04449 -1.459109
H  3.419214 1.790653 0.034311
H  5.10121 1.386652 0.471456
H  -4.914983 -1.178197 -0.595988
H  3.351912 -0.413582 -1.316218
H  4.412839 0.852737 -1.990864
H  -2.758174 -0.917148 -3.166699
H  -2.718361 -2.693034 -3.390872
H  -4.152242 -1.918656 -2.663359
H  -2.488113 -4.258025 -1.367327
H  -2.327375 -3.590893 0.285363
H  -3.895132 -3.503362 -0.563269
H  3.81596 0.523079 2.31469
H  4.186179 -0.909092 1.295663
H  -5.542184 0.752351 0.834246
H  -0.161301 -2.472337 0.351713
H  -0.229077 -1.449419 1.8476
H  1.506003 0.451878 1.552607
H  -3.824374 3.516087 1.513225
H  -5.041065 2.467626 2.305648
H  -3.408913 2.663325 3.008083
H  4.222412 -2.540228 -1.336479
H  5.982865 -2.800669 -1.508931
H  5.076128 -2.005682 -2.841456
H  6.883745 0.688154 -0.782424
H  6.803449 0.053575 -2.462614
H  7.51923 -0.940529 -1.14315
H  -0.045384 3.947567 3.059655
H  0.720551 3.999066 1.433489
H  -0.613169 5.163859 1.832971
