program: Gaussian 09
title: 000040643
version: EM64L-G09RevD.01
frameworkgroup: C1[X(C20H31NO5)]
method: RPBEPBE
basis: SDD
operation: Freq
keyword: #p
keyword: freq=noraman
keyword: PBEPBE/SDD
title: #p freq=noraman PBEPBE/SDD
converged: YES YES NO NO
title: Mulliken charges:
elementType: O O O O O N C C C C C C C C C C C C C C C C C C C C H H H H H H H H H H H H H H H H H H H H H H H H H H H H H H H
charge: -0.282197 -0.263100 -0.274129 -0.260702 -0.220342 -0.092940 -0.232867 0.459230 -0.028920 0.083202 -0.410771 0.370987 -0.699517 -0.700338 -0.476186 0.127020 -0.823638 -0.375945 0.042146 -0.360053 -0.262414 0.267877 -0.688428 -0.695307 -0.612521 -0.612783 0.242601 0.234462 0.205921 0.213304 0.235715 0.211224 0.216351 0.220778 0.232096 0.232014 0.259824 0.224336 0.230020 0.276579 0.230278 0.197188 0.223082 0.231398 0.241935 0.224246 0.209937 0.226793 0.300255 0.201894 0.216957 0.228114 0.189986 0.223653 0.224828 0.225942 0.190921
chargesum: 0.00000
title: Mulliken charges with hydrogens summed into heavy atoms:
elementType: O O O O O N C C C C C C C C C C C C C C C C C C C C
charge: -0.282197 -0.263100 -0.274129 -0.260702 -0.220342 -0.092940 0.009734 0.459230 -0.028920 0.083202 -0.176309 0.370987 -0.044577 -0.051984 -0.244090 0.127020 -0.107464 0.130654 0.272424 0.060218 0.210919 0.267877 -0.027452 0.023799 0.029233 0.028908
polarizability: 2.87588508e+02 -2.52283387e+00 2.76628875e+02 -1.30474395e+01 -1.95670704e+00 1.81427977e+02
1716.lowfreq: -8.2574 -3.4814 -0.0009 -0.0007 -0.0007 2.9788 7.0524 19.7787 23.9710
frequency: 6.3258 19.4321 23.9588 27.0687 33.8984 41.3324 53.2599 56.4241 58.8032 82.7014 83.4673 89.3031 93.2992 114.7390 127.2824 131.6980 155.0336 172.4425 183.2902 199.4864 201.8620 203.5344 215.1128 216.4736 221.7169 224.1557 237.3687 250.4680 258.9036 261.1311 272.9638 281.2104 315.4386 348.8671 369.2165 382.9105 389.0036 400.3154 415.5541 425.6130 439.2752 460.9959 478.1802 486.5052 530.4551 548.2672 590.6488 603.3982 628.1084 680.5136 684.8704 724.8912 738.1062 769.2352 796.4135 797.8321 815.4574 832.8804 841.3616 883.4609 892.6429 900.9839 920.2300 925.7591 931.4581 945.6186 948.3983 954.5405 958.6183 988.7961 1000.7726 1034.4026 1035.5794 1046.3757 1049.5033 1062.4151 1063.5844 1081.1819 1088.2260 1096.6485 1107.6407 1116.0511 1126.4271 1139.5806 1158.0054 1165.6241 1170.4235 1177.3276 1183.2269 1216.8120 1218.2905 1237.1449 1260.6765 1265.9511 1267.5209 1287.0241 1302.0871 1319.9024 1322.9747 1323.6633 1337.1432 1359.6781 1368.8645 1377.6147 1386.1847 1386.3450 1396.2328 1399.2714 1401.1163 1407.1900 1421.4501 1437.5472 1444.2514 1458.6078 1460.9978 1465.0043 1466.6833 1467.3545 1467.9548 1468.4848 1470.9738 1473.6180 1475.0990 1476.6253 1477.9686 1479.2124 1483.5722 1486.7763 1489.4628 1493.4647 1572.6378 1602.2269 1607.1468 1666.2395 2853.7029 2862.0456 2881.6151 2972.4236 2976.3337 2982.3548 2982.9852 2985.9369 2990.2560 3016.3268 3021.7027 3022.0023 3029.8592 3031.7236 3043.0629 3045.8159 3065.3776 3065.9578 3072.1799 3074.6950 3080.1226 3081.8399 3084.0273 3087.4544 3089.7484 3091.0007 3095.5838 3096.6376 3101.5130 3120.2779 3144.6467
redmass: 4.5199 3.0177 3.1901 3.1948 3.4667 4.0996 6.1201 2.9788 4.0080 2.8003 3.2020 3.9667 3.6233 1.0696 3.9633 3.8443 4.2710 4.3861 2.9168 1.7125 1.2966 1.9039 1.5760 1.1273 1.4892 1.8178 1.9065 1.6825 1.6238 1.8109 4.2039 4.6342 2.9267 2.5604 3.2065 3.5119 3.4830 3.1428 3.0579 2.5227 3.4248 3.2515 3.5344 4.2028 4.0434 3.5283 3.9262 6.0949 4.2405 3.9798 6.3330 6.5673 6.4471 4.8335 4.5886 1.2081 3.9629 1.4649 4.5720 5.1642 2.8277 4.7287 1.3852 2.5486 1.1959 1.4391 3.4605 1.4734 1.3354 2.2264 2.2256 1.8358 1.8248 2.4951 1.5499 1.7362 1.6479 2.9002 1.5525 1.9909 1.9991 2.6822 3.2098 1.4676 2.0879 1.9175 1.4156 1.5385 1.9689 1.2036 3.7615 1.7155 2.0116 2.5011 2.6635 1.2473 1.9035 1.3973 1.3627 1.3745 1.4439 2.1243 2.3897 1.1960 1.2970 1.4331 1.2141 1.2421 1.2198 2.9365 1.1444 1.1137 1.1611 1.0521 1.0483 1.0510 1.0512 1.0696 1.0507 1.0518 2.0842 1.0725 1.0832 1.0574 1.0972 1.0662 1.0717 1.0631 1.2214 1.0484 6.0374 10.5762 7.6383 10.9843 1.0568 1.0597 1.0672 1.0348 1.0354 1.0542 1.0383 1.0359 1.0357 1.0843 1.0679 1.0635 1.0866 1.0718 1.0886 1.1049 1.0966 1.0999 1.1002 1.0985 1.1012 1.0989 1.0998 1.1010 1.0993 1.0998 1.1004 1.1077 1.1010 1.0868 1.0965
irintensity: 0.1896 0.1513 0.6139 0.2063 0.0473 2.2348 0.5856 0.5928 0.6564 1.2068 0.5470 1.2055 1.0993 0.3909 0.9669 1.4508 1.6607 2.8779 6.3392 1.0868 1.6488 2.4687 0.5839 3.1781 0.4099 8.4188 3.1827 7.8507 1.2118 5.0604 8.3686 1.2386 1.1330 16.0217 3.4356 3.1177 2.6398 0.9137 11.4882 5.5539 4.1410 8.5049 1.7983 4.2528 3.8510 2.5300 2.7463 1.7716 4.1218 5.0014 10.4831 5.9392 3.1343 21.7277 10.4278 3.3713 7.7156 25.8129 7.1592 1.6046 1.1390 7.3223 12.7804 60.0958 2.1710 0.5441 21.2654 0.1390 0.2109 38.6868 75.8932 36.4665 62.9266 160.0441 3.3655 38.4034 22.7505 295.8394 3.8148 7.7848 40.7755 2.7043 419.5077 3.9983 10.6212 14.9017 2.3810 2.0853 25.8761 41.8985 217.1153 7.9582 9.3788 12.9256 40.1893 2.8721 18.4731 3.3433 2.1185 2.8343 4.3525 11.1018 3.1813 17.7448 25.0258 16.7429 15.7885 19.9529 17.4557 42.6927 2.5879 31.7062 4.0456 6.3246 10.8969 29.9235 2.7546 7.0395 3.1022 3.2950 19.7403 9.3775 3.8981 10.8122 37.2416 1.3526 16.0023 17.4001 28.7713 19.9307 14.3367 185.1473 11.9219 205.4368 70.5287 122.4428 147.4328 31.2380 38.2398 61.0525 15.5193 16.6361 30.9505 1.9073 41.0100 8.4845 5.6630 54.8765 10.1755 6.8244 13.8147 1.2422 37.2188 88.4791 22.9251 9.0976 32.9758 50.1456 51.1990 12.1521 22.5077 34.1334 22.8856 11.1247 28.3786
temp: 298.150 k
press: 1.00000 atm
elementType: 8 8 8 8 8 7 6 6 6 6 6 6 6 6 6 6 6 6 6 6 6 6 6 6 6 6 1 1 1 1 1 1 1 1 1 1 1 1 1 1 1 1 1 1 1 1 1 1 1 1 1 1 1 1 1 1 1
symmnumber: 1
zpe: 1249799.9 jmol-1
zpe.correction: 0.476024 hartree
zpe.thermalcorrener: 0.506973 hartree
zpe.thermalcorrenthalpy: 0.507917 hartree
zpe.thermalcorrgfe: 0.409279 hartree
zpe.sumelectzpe: -1209.548864 hartree
zpe.sumelectthermal: -1209.517915 hartree
zpe.sumelectthermalent: -1209.516970 hartree
zpe.sumelectthermalfe: -1209.615608 hartree
dipole: -0.4997 -0.5208 -1.9817
dipole: 2.1090
quadrupole: -130.9069 -138.9606 -162.9598
quadrupole: 1.0254 2.0420 -0.3784
quadrupole: 13.3689 5.3152 -18.6841 1.0254 2.0420 -0.3784
hfenergy: -1210.0248873 hartree
pointgroup: C01 [X(C20H31N1O5)]
dipole: 0.1436054 -0.1732068 0.7986647 debye
polarizability: 288.897297|1.7141724|276.5005707|-6.6967097|-2.0871517|180.2474921 unknown
InChI: InChI=1S/C20H31NO5/c1-13(2)16-9-8-15(5)18(20(23)26-14(3)4)19(16)25-12-17(22)24-11-10-21(6)7/h8-9,13-14H,10-12H2,1-7H3
charge 0 multiplicity 1
57 atoms
O  -0.450439 -0.765225 -0.711132
O  -1.98241 2.590593 -0.524077
O  3.033336 -0.847442 0.235009
O  -0.439425 1.757257 1.012041
O  1.951829 0.58584 -1.257686
N  6.73728 -0.335635 0.506454
C  -1.846571 -3.336371 -0.712642
C  -2.470457 -2.051747 -0.16505
C  -1.753286 -0.829034 -0.139269
C  -2.340998 0.379114 0.323793
C  -3.801946 -2.024038 0.318964
C  -3.68264 0.392488 0.79311
C  -2.632031 -3.85979 -1.944889
C  -1.742021 -4.429917 0.38388
C  -4.39206 -0.833879 0.790638
C  -1.485133 1.616008 0.326245
C  -4.344053 1.666706 1.288066
C  0.664736 -0.93942 0.227997
C  -1.128042 3.829944 -0.722731
C  5.376888 -0.822958 0.830095
C  4.349799 -0.265638 -0.162937
C  1.905378 -0.301506 -0.384762
C  -2.114536 4.948261 -1.063272
C  -0.106229 3.523955 -1.82589
C  7.798718 -1.230498 1.010778
C  6.967055 1.067972 0.909125
H  -0.825322 -3.088369 -1.056102
H  -4.389177 -2.949743 0.320674
H  -3.668198 -4.136568 -1.673753
H  -2.140877 -4.758739 -2.361704
H  -2.680526 -3.093145 -2.738351
H  -2.742744 -4.728826 0.748271
H  -1.246102 -5.333092 -0.017641
H  -1.16083 -4.074215 1.254468
H  -5.424492 -0.848648 1.158147
H  -3.757812 2.143298 2.096089
H  -4.430709 2.407073 0.473071
H  -5.353535 1.457495 1.680033
H  0.854656 -2.011833 0.426379
H  0.453992 -0.417435 1.181363
H  -0.612345 4.019369 0.236882
H  5.06166 -0.566127 1.872153
H  5.371012 -1.925118 0.751485
H  4.269813 0.835252 -0.136987
H  4.584834 -0.577732 -1.194838
H  -2.837457 5.105427 -0.243826
H  -1.564914 5.892645 -1.229187
H  -2.674306 4.706339 -1.983799
H  0.52583 2.659448 -1.561402
H  0.548873 4.401767 -1.979653
H  -0.621121 3.303147 -2.777786
H  7.646384 -2.251164 0.617754
H  7.839731 -1.289957 2.128199
H  8.78165 -0.872387 0.655266
H  6.218571 1.733016 0.445748
H  7.963013 1.392551 0.559149
H  6.923002 1.21693 2.018239
