program: Gaussian 09
title: 000034726
version: EM64L-G09RevD.01
frameworkgroup: C1[X(C10H20O2)]
method: RPBEPBE
basis: SDD
operation: Freq
keyword: #pfreq=noraman
keyword: PBEPBE/SDD
title: #p freq=noraman PBEPBE/SDD
converged: YES YES NO NO
title: Mulliken charges:
elementType: O O C C C C C C C C C C H H H H H H H H H H H H H H H H H H H H
charge: -0.329497 -0.428789 0.472353 -0.567990 -0.164585 -0.007163 -0.444087 -0.469373 -0.379329 -0.721264 -0.711164 -0.697370 0.231851 0.243813 0.210302 0.197862 0.203007 0.204958 0.227690 0.212682 0.207940 0.175149 0.212141 0.248287 0.208799 0.221380 0.225926 0.218603 0.335204 0.245353 0.205903 0.211406
chargesum: 0.00000
title: Mulliken charges with hydrogens summed into heavy atoms:
elementType: O O C C C C C C C C C C
charge: -0.329497 -0.093585 0.472353 -0.092325 0.045716 0.190700 -0.036122 -0.029001 0.003760 -0.052037 -0.045255 -0.034708
polarizability: 1.30467717e+02 6.40097878e-05 1.09529422e+02 3.43984998e-01 1.19790037e+00 9.86119376e+01
1716.lowfreq: -16.8394 -8.9360 -0.0008 0.0000 0.0004 11.4171 26.0733 64.7509 79.2350
frequency: 24.5951 64.6691 79.1485 86.7276 118.1792 152.3602 187.2861 209.8617 219.3630 222.3568 255.5012 283.6621 286.3898 324.4163 331.0938 355.1213 413.2472 420.0494 499.6349 530.1533 538.9681 601.4436 723.4633 754.8662 773.3384 793.0917 843.9358 886.3801 896.8369 925.2988 958.5774 969.1181 988.5539 1023.7598 1025.3061 1045.6531 1051.4175 1065.6204 1075.3239 1089.8749 1124.4140 1132.2999 1154.0127 1188.2325 1223.3884 1231.0119 1243.8766 1254.6218 1260.7860 1282.4323 1297.2966 1306.9457 1323.6370 1328.0702 1344.7027 1371.2285 1374.8773 1383.1115 1389.0187 1389.7185 1446.4417 1455.8858 1462.8448 1473.2989 1474.5095 1481.4123 1482.5190 1485.2424 1487.5987 1493.4781 2927.3890 2955.4307 2959.1705 2974.6199 2978.2830 2982.4175 2984.5285 2989.7042 3012.3941 3023.2698 3025.3704 3041.7244 3071.4009 3073.5551 3074.1977 3077.9020 3084.4196 3094.0203 3094.9767 3558.5814
redmass: 3.4738 3.0135 2.5170 2.6198 1.9287 1.8151 1.5993 2.0217 1.0841 1.5101 2.4805 1.3580 1.6521 2.5137 2.7513 2.8998 3.1953 2.5216 2.6003 3.0386 4.2185 2.9697 2.6212 1.6266 1.3610 1.2677 1.7421 2.1376 1.7621 2.6550 2.1536 1.9006 1.7868 1.7554 2.9123 2.9051 2.2131 1.8509 1.8906 1.8204 2.0208 1.9629 1.9676 2.0762 1.4577 1.5309 1.2266 1.2386 1.2126 1.3425 1.4226 1.2857 1.5329 1.4210 1.6408 1.7164 1.4479 1.2198 1.2307 1.2081 1.0850 1.0720 1.0655 1.0727 1.0476 1.0510 1.0538 1.0517 1.0553 1.0664 1.0821 1.0686 1.0791 1.0563 1.0381 1.0367 1.0388 1.0611 1.0623 1.0978 1.0993 1.0987 1.0994 1.0988 1.0994 1.1003 1.1024 1.0999 1.1001 1.0662
irintensity: 0.9422 0.3694 0.2158 0.2380 0.1467 0.3005 0.9693 1.0594 0.2226 1.7088 12.5164 72.0584 76.2704 0.3235 3.4655 7.5370 5.3263 2.5524 6.8420 5.8532 1.7405 1.1813 12.1405 4.7690 0.4708 7.8542 8.0494 15.7302 14.5760 57.7763 85.6224 3.3474 9.4015 0.8697 99.3387 3.5507 13.7237 8.2559 2.7836 5.0461 5.1952 0.6921 6.0012 2.0915 23.5571 3.9556 2.0019 3.4242 11.4584 24.5443 7.9703 2.9722 4.3053 7.4231 6.7013 4.3787 5.1605 17.0008 19.7939 12.9268 5.3202 7.4003 13.2341 10.4356 5.6134 15.2478 5.6295 7.9063 17.9374 2.8112 22.9651 36.9264 63.4523 31.7698 42.2361 33.5286 31.8098 15.5562 13.8745 35.7961 30.2940 7.9397 32.5692 59.4807 80.3998 27.7288 35.0169 36.3513 30.2353 2.8356
temp: 298.150 k
press: 1.00000 atm
elementType: 8 8 6 6 6 6 6 6 6 6 6 6 1 1 1 1 1 1 1 1 1 1 1 1 1 1 1 1 1 1 1 1
symmnumber: 1
zpe: 744226.3 jmol-1
zpe.correction: 0.283461 hartree
zpe.thermalcorrener: 0.298138 hartree
zpe.thermalcorrenthalpy: 0.299082 hartree
zpe.thermalcorrgfe: 0.241940 hartree
zpe.sumelectzpe: -542.498947 hartree
zpe.sumelectthermal: -542.484270 hartree
zpe.sumelectthermalent: -542.483326 hartree
zpe.sumelectthermalfe: -542.540468 hartree
dipole: -0.6283 0.0634 -0.8404
dipole: 1.0513
quadrupole: -67.3595 -83.7803 -74.2449
quadrupole: -0.1648 2.0094 -0.1015
quadrupole: 7.7687 -8.6521 0.8834 -0.1648 2.0094 -0.1015
hfenergy: -542.7824078 hartree
pointgroup: C01 [X(C10H20O2)]
dipole: -0.2572608 -0.028971 0.3225497 debye
polarizability: 130.4563413|0.1669237|109.5194438|0.6513161|1.253875|98.6332917 unknown
InChI: InChI=1S/C10H20O2/c1-4-9-8(11)7-10(5-2,6-3)12-9/h8-9,11H,4-7H2,1-3H3
charge 0 multiplicity 1
32 atoms
O  -0.24412 0.819181 -0.195559
O  -1.775682 -2.497516 0.322028
C  0.983697 -0.022224 0.101378
C  0.428652 -1.446029 0.41379
C  -1.079399 -1.246461 0.646184
C  -1.4195 -0.071025 -0.303077
C  1.653943 0.616318 1.344118
C  1.864376 0.009661 -1.170813
C  -2.675975 0.729462 0.056358
C  2.043207 2.098742 1.167001
C  3.192566 -0.77085 -1.050277
C  -2.968901 1.871152 -0.939956
H  0.927243 -1.910793 1.280383
H  0.544781 -2.12119 -0.454029
H  -1.287053 -0.940707 1.695044
H  -1.502379 -0.475671 -1.338212
H  2.547551 0.018937 1.614777
H  0.944716 0.522919 2.190474
H  2.070502 1.064559 -1.429971
H  1.26388 -0.403766 -2.004858
H  -2.544501 1.141662 1.076381
H  -3.540783 0.032204 0.091473
H  2.851984 2.225544 0.424073
H  1.170585 2.682697 0.827222
H  2.398919 2.526179 2.122327
H  3.860103 -0.324715 -0.290783
H  3.020581 -1.827529 -0.771491
H  3.733758 -0.765461 -2.013805
H  -2.736577 -2.398239 0.541319
H  -2.109536 2.561624 -0.988108
H  -3.143561 1.474776 -1.957944
H  -3.863979 2.446058 -0.640547
