program: Gaussian 09
title: 000005326
version: EM64L-G09RevD.01
frameworkgroup: C1[X(C11H12N4O3S)]
method: RPBEPBE
basis: SDD
operation: Freq
keyword: #p
keyword: freq=noraman
keyword: PBEPBE/SDD
title: #p freq=noraman PBEPBE/SDD
converged: YES YES NO NO
title: Mulliken charges:
elementType: S O O O N N N N C C C C C C C C C C C H H H H H H H H H H H H
charge: 0.966419 -0.544387 -0.499846 -0.259768 -0.572775 -0.030068 -0.040047 -0.688603 -0.087729 -0.225676 -0.144208 0.517163 -0.391392 -0.409713 0.064414 0.334357 -0.339317 -0.346593 -0.530616 0.283236 0.283652 0.348632 0.230293 0.229487 0.260362 0.257878 0.314119 0.314396 0.228454 0.251970 0.225907
chargesum: 0.00000
title: Mulliken charges with hydrogens summed into heavy atoms:
elementType: S O O O N N N N C C C C C C C C C C C
charge: 0.966419 -0.544387 -0.499846 -0.259768 -0.224143 -0.030068 -0.040047 -0.060088 -0.087729 0.057559 0.139444 0.517163 -0.161099 -0.180226 0.064414 0.334357 -0.078955 -0.088716 0.175715
polarizability: 2.83424870e+02 -4.53206392e+00 1.94639649e+02 -1.41666787e+01 -1.84873179e+01 1.22315649e+02
1716.lowfreq: -11.2678 -8.5290 -5.0236 -0.0021 -0.0012 -0.0009 13.9924 33.2672 45.1404
frequency: 13.8018 33.2275 45.1186 54.2288 80.9057 89.6976 132.4369 140.5754 150.8287 193.9093 210.2169 221.2240 234.9233 259.6413 300.7549 322.1147 372.5631 400.6263 402.3032 408.5256 411.5825 414.6394 421.0048 426.0272 438.1000 500.0999 517.9390 526.9783 553.9638 602.2590 622.3552 623.5433 719.8926 732.1524 749.5783 784.7184 800.8120 810.2455 816.1342 833.6808 856.0490 892.3475 927.6557 945.7672 949.7185 962.4042 965.1496 981.6518 999.5066 1022.0231 1050.9376 1111.1895 1131.4990 1138.4388 1167.4033 1184.4156 1231.3230 1273.5253 1298.6369 1302.0679 1322.3100 1358.2212 1369.5329 1400.6654 1421.8613 1435.8464 1443.6520 1465.9452 1469.7219 1490.2601 1497.7121 1565.4807 1586.8798 1613.8501 1648.5974 2964.4155 3054.7812 3133.6797 3134.5003 3136.8740 3147.6736 3150.0861 3165.1982 3180.7063 3473.9102 3562.9137 3701.9409
redmass: 5.2979 4.1121 4.6378 6.1844 6.4581 4.4812 6.6390 5.7468 4.9066 5.7593 2.3706 1.9158 6.3920 5.9963 6.0286 5.7587 7.5888 3.8768 4.4672 1.0660 2.8745 4.3282 4.5782 1.8514 3.2744 2.2353 2.8675 2.9112 4.6501 5.8813 6.8950 5.5917 2.9197 6.2899 2.2749 8.7835 6.0802 1.3066 7.8972 1.8156 5.8950 1.5359 1.4139 1.5360 6.6167 7.8267 1.3884 5.0480 3.9245 1.4402 2.5133 1.2579 1.2334 1.7231 1.6320 1.1194 3.0413 3.6440 1.4989 1.3009 2.5837 2.3368 2.4505 5.6514 2.3286 3.7387 1.5552 1.0506 1.0619 2.9011 6.8002 5.1882 7.3776 4.7865 1.2269 1.0328 1.1044 1.0997 1.0898 1.0897 1.0921 1.0930 1.0958 1.0951 1.0763 1.0452 1.1040
irintensity: 1.7447 1.3927 2.1869 0.2295 0.9557 3.1296 0.9571 1.2197 2.4155 2.3724 2.0995 3.0211 13.8462 1.2359 35.7481 8.8250 9.4474 20.9276 15.1515 4.2962 0.7982 4.0401 28.0304 133.2264 363.9148 31.9964 24.7001 39.2274 26.3084 27.7746 1.3787 25.8148 10.4952 111.7761 179.9578 2.3600 42.6552 3.0975 96.6764 83.0194 17.9193 25.3968 5.7555 6.8947 53.5585 67.6779 1.3529 7.9875 16.2932 1.4525 60.9564 0.1138 15.4585 5.8687 8.9364 55.5832 189.8937 75.5508 5.0572 6.9892 70.7088 0.6703 9.8259 1.5890 570.6919 2.0483 251.8751 14.5557 8.9387 75.9691 44.0394 1.6614 11.3711 170.5548 268.9829 72.0017 42.3545 24.1994 13.9257 15.1744 8.2373 31.5621 7.0908 5.8324 61.8035 112.8449 24.9132
temp: 298.150 k
press: 1.00000 atm
elementType: 16 8 8 8 7 7 7 7 6 6 6 6 6 6 6 6 6 6 6 1 1 1 1 1 1 1 1 1 1 1 1
symmnumber: 1
zpe: 590131.3 jmol-1
zpe.correction: 0.224769 hartree
zpe.thermalcorrener: 0.243378 hartree
zpe.thermalcorrenthalpy: 0.244323 hartree
zpe.thermalcorrgfe: 0.176017 hartree
zpe.sumelectzpe: -1267.529651 hartree
zpe.sumelectthermal: -1267.511042 hartree
zpe.sumelectthermalent: -1267.510098 hartree
zpe.sumelectthermalfe: -1267.578403 hartree
dipole: -0.2479 -7.3071 -2.7464
dipole: 7.8101
quadrupole: -63.6616 -119.0003 -123.3160
quadrupole: -17.9555 -4.0498 -5.7293
quadrupole: 38.3310 -17.0076 -21.3233 -17.9555 -4.0498 -5.7293
hfenergy: -1267.7544203 hartree
pointgroup: C01 [X(C11H12N4O3S1)]
dipole: -0.3354515 3.0542309 0.0269106 debye
polarizability: 282.8400494|13.7375497|175.4084817|-0.1401977|-38.4440326|142.131636 unknown
InChI: InChI=1S/C11H12N4O3S/c1-18-9-6-13-11(14-7-9)15-19(16,17)10-4-2-8(12)3-5-10/h2-7,15H,12H2,1H3
charge 0 multiplicity 1
31 atoms
S  1.20584 -1.627144 0.215566
O  2.070854 -2.605587 1.187474
O  0.540331 -2.170178 -1.160465
O  -4.847225 1.246965 -0.281429
N  -0.141771 -1.069245 1.415184
N  -1.317778 0.278239 -0.142611
N  -2.462596 -0.843208 1.70295
N  4.541972 3.272109 -0.956463
C  2.198837 -0.097302 -0.129261
C  3.324895 0.150263 0.676867
C  1.822507 0.732756 -1.200254
C  3.764386 2.154216 -0.681446
C  4.109504 1.280938 0.395968
C  2.612552 1.860307 -1.475741
C  -1.350217 -0.539195 0.964834
C  -3.705206 0.607224 0.201335
C  -2.497406 0.825654 -0.516857
C  -3.631317 -0.245577 1.33103
C  -6.102087 1.017744 0.447789
H  3.585121 -0.539211 1.486161
H  0.929796 0.498931 -1.786467
H  -0.20882 -1.753524 2.18301
H  4.99479 1.492218 1.00647
H  2.341142 2.523173 -2.305263
H  -2.50235 1.464453 -1.406404
H  -4.506117 -0.481988 1.945045
H  5.364297 3.486547 -0.399618
H  4.30738 3.895627 -1.723611
H  -6.381814 -0.053278 0.433018
H  -6.856493 1.60774 -0.091532
H  -6.026603 1.371232 1.494319
