program: Gaussian 09
title: 000005391
version: EM64L-G09RevD.01
frameworkgroup: C1[X(C16H13ClN2O2)]
method: RPBEPBE
basis: SDD
operation: Freq
keyword: #p
keyword: freq=noraman
keyword: PBEPBE/SDD
title: #p freq=noraman PBEPBE/SDD
converged: YES YES NO NO
title: Mulliken charges:
elementType: Cl O O N N C C C C C C C C C C C C C C C C H H H H H H H H H H H H H
charge: -0.039879 -0.406492 -0.249521 -0.208963 -0.025527 0.258121 0.222182 -0.018901 -0.276617 0.098917 0.317375 -0.331256 -0.321098 -0.638509 -0.140621 -0.236875 -0.366226 -0.374771 -0.235028 -0.228977 -0.236230 0.265947 0.299774 0.251951 0.240370 0.234839 0.283239 0.263708 0.251712 0.280282 0.230588 0.232202 0.371360 0.232922
chargesum: 0.00000
title: Mulliken charges with hydrogens summed into heavy atoms:
elementType: Cl O O N N C C C C C C C C C C C C C C C C
charge: -0.039879 -0.035132 -0.249521 -0.208963 -0.025527 0.258121 0.222182 -0.018901 -0.010670 0.098917 0.317375 -0.031482 -0.069147 0.119939 -0.140621 0.026833 -0.114514 -0.094488 -0.004440 0.003225 -0.003308
polarizability: 2.56276671e+02 -8.05643815e+00 2.41988875e+02 2.91733731e+00 1.55603334e+01 1.31452665e+02
1716.lowfreq: -7.4404 -2.9585 0.0019 0.0020 0.0024 2.5082 39.8749 55.6892 66.1104
frequency: 39.8652 55.6843 66.1096 71.7030 98.4342 105.0723 151.1997 161.9026 174.3095 196.7859 229.1208 251.7618 274.1350 285.6871 310.8901 322.0840 359.9911 372.5328 393.8709 405.2886 407.2753 424.1630 452.0323 480.3308 495.2054 521.0849 565.9730 608.5153 616.5870 638.2964 670.6307 676.0330 691.1949 701.7035 741.0552 781.0631 792.9540 796.2705 822.7606 859.7549 894.0025 901.3912 921.9254 939.1990 953.2446 964.8520 987.8572 989.4076 1004.3022 1008.4354 1027.2556 1071.1801 1085.4190 1090.2492 1111.3320 1116.1464 1134.7976 1169.9750 1174.1303 1189.2929 1206.3862 1256.9142 1271.8171 1285.6554 1303.0767 1318.0221 1319.5230 1370.3715 1380.3277 1383.1462 1395.3431 1426.3707 1435.2226 1463.8726 1468.2261 1480.6779 1498.2839 1536.9310 1567.0717 1587.2906 1593.2606 1609.2218 1611.6486 2980.1139 2992.0194 3086.5278 3127.9957 3128.7096 3137.2304 3149.0755 3158.6908 3160.3429 3169.8256 3170.9379 3179.4265 3479.4780
redmass: 5.8640 4.2251 7.4128 5.4870 4.1687 7.7437 1.5672 2.0919 5.6573 5.2971 4.2608 4.7750 4.1280 4.7272 6.3805 4.3562 4.3010 4.3537 6.1551 2.8178 3.1651 2.4466 5.7989 6.1895 3.9633 5.1388 4.0629 7.0238 6.6352 6.4675 5.4741 6.5123 6.7416 1.7543 3.3355 3.6187 3.1352 6.1951 1.4680 1.2496 4.1787 1.6744 3.2814 1.5127 1.3510 5.6595 1.3805 6.1603 1.3358 7.0950 2.1859 3.3060 1.5917 2.1435 1.6561 1.5765 1.8765 1.8238 1.0562 1.1297 1.4657 1.8416 2.1875 2.3433 1.8772 2.1600 1.6316 7.6152 2.0579 7.7347 1.8858 1.2035 2.2907 1.3560 1.7487 2.3670 1.0655 8.5876 8.2394 6.4986 7.0354 6.2668 7.8226 1.0829 1.0375 1.0965 1.0849 1.1026 1.0883 1.0931 1.0882 1.0962 1.0928 1.0999 1.0973 1.0644
irintensity: 1.8736 0.2102 0.5044 0.7689 1.7457 0.9891 0.2880 0.5494 1.7378 7.8779 16.7555 8.6081 7.3472 11.4884 0.6109 20.0307 37.0717 0.6105 10.6157 3.4060 20.8920 60.3861 12.0967 6.0699 5.2637 13.4168 10.0471 1.9047 0.1951 6.5722 28.4460 1.6847 8.4795 59.0512 7.5922 3.5131 55.4539 7.7085 39.6776 3.2779 12.7862 11.4308 7.0827 3.3514 0.7264 56.3504 3.6803 1.3633 1.7109 56.3649 6.8981 255.4289 11.1617 18.5972 41.7160 7.7827 4.3987 2.6204 0.2510 11.7490 0.2969 41.7414 93.9502 23.1047 16.4608 42.3004 13.4028 16.5076 83.9896 0.8100 25.7663 28.3634 12.0503 89.7079 63.3559 3.4740 11.4453 79.1102 21.5215 1.2578 62.7450 44.0096 291.1319 13.3612 37.0044 17.2763 1.0315 1.9693 5.2684 26.4520 3.3096 16.2282 0.9405 19.1892 3.5918 29.0116
temp: 298.150 k
press: 1.00000 atm
elementType: 17 8 8 7 7 6 6 6 6 6 6 6 6 6 6 6 6 6 6 6 6 1 1 1 1 1 1 1 1 1 1 1 1 1
symmnumber: 1
zpe: 666874.7 jmol-1
zpe.correction: 0.253999 hartree
zpe.thermalcorrener: 0.271953 hartree
zpe.thermalcorrenthalpy: 0.272897 hartree
zpe.thermalcorrgfe: 0.207852 hartree
zpe.sumelectzpe: -1336.036176 hartree
zpe.sumelectthermal: -1336.018223 hartree
zpe.sumelectthermalent: -1336.017279 hartree
zpe.sumelectthermalfe: -1336.082323 hartree
dipole: -0.8816 3.6223 3.4138
dipole: 5.0550
quadrupole: -118.9162 -136.2923 -130.3680
quadrupole: 18.9360 5.7663 1.8236
quadrupole: 9.6093 -7.7668 -1.8425 18.9360 5.7663 1.8236
hfenergy: -1336.2901755 hartree
pointgroup: C01 [X(C16H13Cl1N2O2)]
dipole: -0.0579847 1.5371337 1.2605982 debye
polarizability: 252.5658568|-9.8670355|246.9525254|6.6032171|8.3142627|130.1998283 unknown
InChI: InChI=1S/C16H13ClN2O2/c1-19-13-8-7-11(17)9-12(13)14(18-15(20)16(19)21)10-5-3-2-4-6-10/h2-9,15,20H,1H3
charge 0 multiplicity 1
34 atoms
Cl -0.258136 4.657137 -1.151968
O  1.760496 -2.935869 -1.917706
O  2.88044 -2.745174 0.555887
N  2.319177 -0.484233 0.803387
N  0.040153 -1.716423 -0.754724
C  1.679238 0.70015 0.310387
C  0.345396 0.686272 -0.219394
C  -0.462532 -0.573264 -0.32956
C  1.457081 -1.749913 -1.174694
C  2.294936 -1.709668 0.12864
C  -1.913724 -0.551935 0.033296
C  -0.225973 1.912186 -0.660644
C  2.372273 1.936428 0.420969
C  3.165721 -0.399271 2.019452
C  0.496362 3.108964 -0.562901
C  1.79372 3.142314 -0.012424
C  -2.443108 0.380805 0.96646
C  -2.781551 -1.524773 -0.534857
C  -3.810369 0.344552 1.317493
C  -4.146168 -1.555312 -0.187222
C  -4.667353 -0.61953 0.739578
H  1.717889 -0.89588 -1.832498
H  -1.236884 1.910771 -1.077203
H  3.385454 1.952482 0.832624
H  2.696462 0.27898 2.749455
H  4.186435 -0.044516 1.784989
H  3.247784 -1.412456 2.441623
H  2.343923 4.084255 0.063732
H  -1.785624 1.12023 1.436154
H  -2.358075 -2.247431 -1.239233
H  -4.204305 1.063457 2.044256
H  -4.805692 -2.305477 -0.637155
H  1.992672 -3.651482 -1.263814
H  -5.72912 -0.644076 1.009115
