program: Gaussian 09
title: 000034753
version: EM64L-G09RevD.01
frameworkgroup: C1[X(C22H14O4)]
method: RPBEPBE
basis: SDD
operation: Freq
keyword: #pfreq=noraman
keyword: PBEPBE/SDD
title: #p freq=noraman PBEPBE/SDD
converged: YES YES NO NO
title: Mulliken charges:
elementType: O O O O C C C C C C C C C C C C C C C C C C C C C C H H H H H H H H H H H H H H
charge: -0.174601 -0.174507 -0.215488 -0.215342 0.208809 0.208798 0.402407 0.402340 0.135177 0.135398 -0.366830 -0.366743 -0.424848 -0.424893 -0.420586 -0.420596 -0.328981 -0.329171 -0.240186 -0.240175 -0.243274 -0.243221 -0.240452 -0.240473 0.161783 0.161612 0.283967 0.283923 0.243602 0.243603 0.240083 0.240090 0.276862 0.276831 0.237266 0.237273 0.232700 0.232683 0.232578 0.232586
chargesum: 0.00000
title: Mulliken charges with hydrogens summed into heavy atoms:
elementType: O O O O C C C C C C C C C C C C C C C C C C C C C C
charge: -0.174601 -0.174507 -0.215488 -0.215342 0.208809 0.208798 0.402407 0.402340 0.135177 0.135398 -0.082863 -0.082819 -0.181246 -0.181291 -0.180503 -0.180506 -0.052120 -0.052340 -0.002919 -0.002902 -0.010574 -0.010539 -0.007874 -0.007887 0.161783 0.161612
polarizability: 4.30591741e+02 1.04471296e+01 2.88922317e+02 2.31103751e-02 2.00408927e-02 1.20821325e+02
1716.lowfreq: -9.6755 -5.8139 -4.5438 0.0003 0.0006 0.0007 4.4901 13.9118 22.2418
frequency: 3.4777 13.8040 22.2296 41.5257 56.0827 87.3794 89.0939 127.6379 172.6330 177.6166 178.9717 182.0734 203.9952 239.0736 296.7397 312.7839 356.4472 361.5136 364.0384 397.0830 403.0485 437.0275 447.1559 470.3072 470.3807 501.1654 501.4451 515.3396 524.6960 552.1429 560.1086 624.7202 625.9530 637.0208 655.0692 696.9795 700.9892 718.8959 745.7510 750.6753 758.7919 785.9509 786.3516 787.1272 788.7384 794.3756 800.7899 811.5969 824.7880 828.7292 887.6285 888.1622 903.5926 906.6425 943.7717 944.0293 971.7733 971.8259 996.4759 996.5232 1000.5710 1000.6098 1029.2900 1029.5339 1057.0049 1065.2527 1082.3176 1082.3537 1152.7477 1152.8289 1177.4450 1177.5873 1187.2321 1187.5523 1234.6520 1236.1872 1240.2870 1244.1243 1278.8373 1279.4215 1374.5375 1375.7553 1403.6203 1403.6609 1413.7926 1413.9333 1440.5055 1440.6678 1451.4126 1452.0235 1516.2814 1517.0239 1581.1129 1581.2170 1589.5333 1589.9359 1628.6290 1629.0773 1659.2684 1673.6990 3126.1312 3126.1807 3129.2118 3129.2555 3140.4385 3140.4789 3157.2775 3157.3343 3160.3958 3160.4663 3180.5769 3180.8263 3183.0852 3183.3524
redmass: 5.2620 6.2489 6.5914 9.3394 9.0156 5.1294 5.5434 6.0874 6.2602 4.2992 4.2643 5.6308 5.6400 4.9601 12.0994 7.6786 7.3364 6.8411 7.8526 3.7452 4.0167 4.4251 4.7954 3.2558 3.2583 4.5436 4.3502 6.3163 7.2440 5.4897 5.4168 3.8137 3.7237 7.4304 6.5109 4.1207 4.4015 7.0391 2.3907 1.4938 2.8875 3.2160 5.6042 2.1195 2.5735 5.9009 5.5140 4.4049 1.5621 1.9202 1.6982 1.7197 6.0713 6.1122 1.4038 1.4055 1.3898 1.3906 1.3768 1.3767 1.3607 1.3604 2.6879 2.6967 3.7858 3.7130 2.2937 2.2889 1.4205 1.4187 1.1503 1.1431 1.2983 1.3040 1.7487 1.7111 2.1210 2.1415 1.7281 1.7443 2.3767 2.4081 2.8080 2.8018 6.5545 6.5912 2.3487 2.3495 2.3360 2.3500 3.7876 3.8035 6.9647 6.9669 5.4950 5.4367 6.3824 6.3689 12.1085 12.4790 1.0867 1.0867 1.0882 1.0882 1.0908 1.0908 1.0937 1.0938 1.0974 1.0974 1.0965 1.0965 1.0958 1.0958
irintensity: 0.0031 1.0588 1.8560 0.4363 0.2781 0.5864 0.4900 0.9823 0.3232 0.2516 5.5340 5.2290 3.0712 0.0017 0.0001 7.6833 4.2998 0.0512 1.8344 0.9555 13.8490 3.2622 3.8519 0.3371 0.4183 23.3651 10.2220 6.8203 1.0954 13.1025 0.4779 8.8026 0.7748 0.1306 11.3552 9.1239 0.8412 0.1424 78.9007 1.7529 28.6068 18.3178 0.1027 110.1742 43.3405 211.5469 64.0603 47.3660 14.5924 64.5430 3.6015 9.0244 273.3620 16.1088 0.4219 0.2857 1.1143 3.7716 1.0941 3.1796 0.3131 0.4736 0.0320 6.9733 316.3574 22.4677 4.7675 6.1598 28.6809 1.8367 22.6621 2.2331 36.7361 2.5247 130.6816 2.6623 125.1336 1.1189 8.7767 2.6809 5.2362 0.8876 6.0013 0.9509 10.5942 4.8679 4.8612 0.0590 17.2524 0.9368 105.0841 5.9556 29.0752 1.1099 40.9015 0.7294 16.1923 0.1185 193.7186 76.0516 0.4366 0.3991 4.6830 4.1571 17.1456 18.2856 39.8508 2.7626 57.9723 2.7271 6.4207 3.6230 10.4274 8.5142
temp: 298.150 k
press: 1.00000 atm
elementType: 8 8 8 8 6 6 6 6 6 6 6 6 6 6 6 6 6 6 6 6 6 6 6 6 6 6 1 1 1 1 1 1 1 1 1 1 1 1 1 1
symmnumber: 1
zpe: 776300.3 jmol-1
zpe.correction: 0.295677 hartree
zpe.thermalcorrener: 0.316235 hartree
zpe.thermalcorrenthalpy: 0.317179 hartree
zpe.thermalcorrgfe: 0.241665 hartree
zpe.sumelectzpe: -1145.838585 hartree
zpe.sumelectthermal: -1145.818027 hartree
zpe.sumelectthermalent: -1145.817083 hartree
zpe.sumelectthermalfe: -1145.892597 hartree
dipole: 0.0026 0.0053 0.0759
dipole: 0.0761
quadrupole: -95.6176 -129.5641 -158.3552
quadrupole: -6.9488 -0.0001 0.0070
quadrupole: 32.2280 -1.7185 -30.5095 -6.9488 -0.0001 0.0070
hfenergy: -1146.1342619 hartree
pointgroup: C01 [X(C22H14O4)]
dipole: 0.0006897 -0.0298389 0.0023257 debye
polarizability: 427.646903|-1.4627012|120.8336658|22.7359042|0.845435|291.8548129 unknown
InChI: InChI=1S/C22H14O4/c23-21(19-13-5-9-15-7-1-3-11-17(15)19)25-26-22(24)20-14-6-10-16-8-2-4-12-18(16)20/h1-14H
charge 0 multiplicity 1
40 atoms
O  -0.726533 -1.541742 0.250519
O  0.709936 -1.551908 -0.238068
O  -1.032413 0.150756 -1.375151
O  1.032347 0.156089 1.368035
C  -4.005723 -0.077607 -0.556456
C  4.003473 -0.112246 0.5562
C  -5.285057 -0.049826 0.129396
C  5.283961 -0.104724 -0.128234
C  -2.835248 -0.462136 0.208886
C  2.830341 -0.493444 -0.206773
C  -3.971965 0.259983 -1.950541
C  3.971692 0.240575 1.946624
C  -5.353674 -0.378902 1.522825
C  5.351129 -0.449883 -1.517806
C  -6.468204 0.309112 -0.597072
C  6.469844 0.25032 0.595712
C  -2.945643 -0.776574 1.576706
C  2.939373 -0.824078 -1.570845
C  -4.206186 -0.730925 2.235859
C  4.201213 -0.798439 -2.22859
C  -5.144924 0.602771 -2.629704
C  5.147268 0.578983 2.623378
C  -6.403911 0.629232 -1.953548
C  6.407235 0.58573 1.948534
C  -1.490777 -0.509133 -0.426281
C  1.48445 -0.519168 0.427225
H  -3.014612 0.266693 -2.476679
H  3.013948 0.262414 2.471573
H  -6.328179 -0.344182 2.024527
H  6.32664 -0.430469 -2.018382
H  -7.426869 0.32656 -0.065235
H  7.429239 0.252392 0.064897
H  -2.044333 -1.03824 2.137223
H  2.036124 -1.082447 -2.129702
H  -4.265559 -0.968911 3.302489
H  4.25977 -1.048871 -3.292418
H  -5.098395 0.85939 -3.693661
H  5.102166 0.847483 3.684467
H  -7.311854 0.901912 -2.502063
H  7.317212 0.855258 2.495235
