program: Gaussian 09
title: 000034702
version: EM64L-G09RevD.01
frameworkgroup: C1[X(C7H6Cl2)]
method: RPBEPBE
basis: SDD
operation: Freq
keyword: #pfreq=noraman
keyword: PBEPBE/SDD
title: #p freq=noraman PBEPBE/SDD
converged: NO NO NO NO
title: Mulliken charges:
elementType: Cl Cl C C C C C C C H H H H H H
charge: -0.010647 -0.016726 0.543154 -0.256186 -0.416735 -0.789336 -0.072824 -0.208621 -0.228973 0.240499 0.248669 0.248666 0.222934 0.236465 0.259660
chargesum: 0.00000
title: Mulliken charges with hydrogens summed into heavy atoms:
elementType: Cl Cl C C C C C C C
charge: -0.010647 -0.016726 0.543154 -0.256186 -0.176236 -0.069066 -0.072824 0.027844 0.030686
polarizability: 1.15883637e+02 4.00347329e+00 1.12272470e+02 3.29533500e-03 -3.08609351e-04 4.02351065e+01
1716.lowfreq: -0.0032 -0.0032 -0.0024 5.6886 10.2709 12.0843 94.6735 149.4012 193.4935
frequency: 94.6322 149.3292 193.4935 211.5864 240.7870 254.0620 358.9227 417.1103 468.6155 508.4819 515.8052 545.9811 705.9491 714.6445 778.5644 841.7356 895.2916 972.7046 992.8582 1033.6511 1048.9713 1090.4284 1156.1667 1188.7133 1256.9459 1356.9926 1400.7803 1403.5811 1440.4718 1462.4263 1474.4015 1568.1207 1591.0921 2983.5634 3064.9772 3091.5357 3137.1606 3154.4859 3172.9366
redmass: 6.0236 1.0499 28.9946 3.6964 4.2584 4.2225 10.2420 5.4165 5.2576 3.9492 3.8626 5.8336 3.7745 7.4731 1.2808 5.2224 1.3259 1.3327 1.9812 3.1666 1.5263 2.0054 1.6061 1.4995 1.9969 9.0420 1.7742 1.5651 2.5259 1.0445 1.1339 5.9809 6.9948 1.0365 1.0974 1.0999 1.0873 1.0924 1.0990
irintensity: 0.1876 0.9105 0.0032 0.0004 6.9017 0.8648 2.5155 3.8575 2.4255 0.0489 0.0734 9.9772 6.3643 19.7074 65.9259 29.3967 0.0283 0.3562 3.1571 50.6859 9.5124 4.8910 9.4481 11.3272 2.5635 0.2183 28.9142 19.3215 21.1888 15.1572 33.7013 11.4064 9.4573 18.3522 12.6314 16.8384 4.9432 10.8501 9.1188
temp: 298.150 k
press: 1.00000 atm
elementType: 17 17 6 6 6 6 6 6 6 1 1 1 1 1 1
symmnumber: 1
zpe: 280751.3 jmol-1
zpe.correction: 0.106933 hartree
zpe.thermalcorrener: 0.115455 hartree
zpe.thermalcorrenthalpy: 0.116399 hartree
zpe.thermalcorrgfe: 0.072893 hartree
zpe.sumelectzpe: -1189.814168 hartree
zpe.sumelectthermal: -1189.805645 hartree
zpe.sumelectthermalent: -1189.804701 hartree
zpe.sumelectthermalfe: -1189.848208 hartree
dipole: 2.5219 1.7936 0.0001
dipole: 3.0947
quadrupole: -62.0070 -61.0111 -69.1427
quadrupole: -0.9030 0.0004 -0.0002
quadrupole: 2.0466 3.0425 -5.0891 -0.9030 0.0004 -0.0002
hfenergy: -1189.9211005 hartree
pointgroup: C01 [X(C7H6Cl2)]
dipole: -0.8935559 0.8270062 -0.0000489 debye
dipolederiv: -0.0745636 0.0397557 -0.0000022 0.0302503 -0.7015124 0.000004 0.0000013 0.00001 -0.036151 -0.6697527 0.2040771 -0.0000325 0.230058 -0.1539871 0.0000118 -0.0000401 0.000015 -0.0404655 0.2091386 0.1977241 0.0000138 0.1805998 -0.0884136 0.0000167 0.0000458 0.0000363 0.0330564 -0.2389128 -0.145741 -0.0000075 0.0437497 0.9593927 0.0000032 -0.0000201 -0.0000142 -0.0886026 -0.0189987 -0.022664 0.0000073 -0.1605589 -0.0552179 -0.0000109 0.00001 -0.0000107 -0.1838237 -0.018107 -0.1207169 -0.0000133 -0.1563584 -0.0598211 -0.0000085 -0.0000625 -0.0000252 0.0473056 0.9523138 -0.2316579 0.0000586 -0.4168919 0.0468074 -0.0000247 0.0000647 -0.0000196 -0.0272754 0.0600775 -0.0338752 0.0000051 0.0194792 0.0937519 0.0000079 0.0000029 0.0000037 -0.1378637 -0.2192928 0.0563478 -0.0000088 0.147843 -0.1023363 0.0000084 -0.0000054 0.0000088 -0.123663 -0.0806863 0.0761076 -0.0000075 0.0511643 0.0497467 0.0000037 -0.0000089 0.0000045 0.1597408 0.0512912 -0.0166605 0.0264734 -0.044661 0.0335583 -0.09986 -0.0288646 -0.0996358 -0.0240494 0.0513153 -0.0166202 -0.026505 -0.0446476 0.0334952 0.099885 0.0288492 0.0996526 -0.02396 -0.0739821 0.0602394 0.0000281 0.1608735 0.0045045 -0.0000315 0.0000385 -0.0000158 0.1117991 0.0723691 0.0179131 -0.0000021 0.0156112 -0.104805 -0.0000018 0.0000013 -0.0000042 0.1641942 -0.0022094 -0.0642291 -0.0000074 -0.0565113 0.0448367 -0.0000032 -0.000012 -0.0000054 0.169758 unknown
polarizability: 114.8064325|-4.3309808|113.3496749|0.0033077|-0.0001163|40.2351065 unknown
InChI: InChI=1S/C7H6Cl2/c1-5-3-2-4-6(8)7(5)9/h2-4H,1H3
charge 0 multiplicity 1
15 atoms
Cl 0.188363 -2.510495 -0.000004
Cl 2.849389 -0.629169 0.000115
C  -1.261901 -0.125116 -0.000068
C  0.035931 -0.704761 -0.000026
C  -1.352892 1.289904 -0.000058
C  -2.510047 -0.986641 -0.00013
C  1.195953 0.105072 0.000013
C  -0.196032 2.101593 -0.000029
C  1.085174 1.510799 0.000007
H  -2.346263 1.751784 -0.000091
H  -2.543769 -1.646183 -0.88688
H  -2.543626 -1.646538 0.886359
H  -3.4155 -0.355964 0.000058
H  -0.28648 3.192729 -0.000019
H  1.992101 2.123088 0.000054
