program: Gaussian 09
title: 000005381
version: EM64L-G09RevD.01
frameworkgroup: C1[X(C21H21NO2S)]
method: RPBEPBE
basis: SDD
operation: Freq
keyword: #p
keyword: freq=noraman
keyword: PBEPBE/SDD
title: #p freq=noraman PBEPBE/SDD
converged: YES YES NO NO
title: Mulliken charges:
elementType: S O O N C C C C C C C C C C C C C C C C C C C C C H H H H H H H H H H H H H H H H H H H H H
charge: 0.196369 -0.281547 -0.259997 -0.010610 0.186517 -0.413512 0.587655 -0.734079 -0.757431 -0.711917 -0.450187 -0.570717 -0.243445 0.402607 -0.419692 -0.085079 -0.026952 0.079390 -0.303937 0.237884 -0.284031 -0.477878 0.178965 -0.222638 -0.673123 0.237381 0.216271 0.213328 0.245599 0.224850 0.214395 0.227824 0.219808 0.273332 0.273224 0.254429 0.248550 0.262324 0.253462 0.278270 0.278744 0.230539 0.229744 0.212677 0.231290 0.231344
chargesum: 0.00000
title: Mulliken charges with hydrogens summed into heavy atoms:
elementType: S O O N C C C C C C C C C C C C C C C C C C C C C
charge: 0.196369 -0.281547 -0.259997 -0.010610 0.186517 0.040140 0.587655 -0.050303 -0.095403 -0.165361 -0.450187 -0.316288 0.005105 0.402607 -0.157368 -0.085079 -0.026952 0.079390 -0.050475 0.237884 -0.005762 -0.199134 0.178965 0.237646 0.002189
polarizability: 6.76623526e+02 3.04371016e+01 2.46188681e+02 2.95295919e+00 -2.12719195e+00 1.34202735e+02
1716.lowfreq: -2.6910 -0.0014 0.0008 0.0021 1.7113 4.9830 15.2179 18.2339 22.4663
frequency: 12.4507 17.8853 22.0037 38.4611 45.2128 63.3655 69.3779 74.0981 103.2563 121.0189 123.9873 157.6630 160.5272 208.6637 223.5904 238.4685 250.0122 252.0676 277.9460 283.3729 300.2738 307.5569 326.6239 333.8308 355.5141 362.8485 380.5639 402.1995 407.7702 436.2019 443.2491 470.4017 483.5423 499.3522 520.7882 532.5828 545.5631 582.1719 626.5611 635.8762 636.5184 646.2236 681.8310 695.4465 739.5796 746.3998 782.7634 783.0040 797.9377 803.6357 837.4318 843.4862 867.7406 885.7968 896.4155 915.4490 924.4565 938.1117 957.4035 967.2956 984.6400 986.8589 1004.1276 1010.8547 1021.6328 1032.9009 1057.0184 1072.6376 1103.8875 1110.3798 1112.1804 1120.6059 1135.6352 1151.3650 1157.6828 1183.7830 1197.4788 1217.0952 1246.1029 1248.3681 1261.9588 1265.6696 1283.9377 1307.0462 1311.6554 1330.9328 1340.8117 1350.4569 1358.9021 1367.5698 1378.5226 1397.8558 1400.1064 1404.4794 1449.3243 1451.8480 1453.4448 1463.3936 1467.8612 1470.6037 1473.3282 1477.8518 1486.5242 1492.1867 1497.8139 1529.6851 1542.9699 1580.3938 1603.1485 1608.6526 2234.5341 2972.2249 2976.9254 2980.9860 2996.2641 3009.9080 3029.7048 3042.7387 3067.3130 3068.5382 3073.9901 3078.1091 3082.4525 3092.9442 3101.2832 3108.2709 3135.6376 3152.7033 3159.9205 3165.1760 3169.1170 3173.6983
redmass: 3.8516 5.4482 5.9918 3.2337 3.3483 4.6828 4.6503 6.4595 3.7105 3.3137 5.0473 4.9298 6.4186 1.6311 2.8368 3.3170 1.7522 1.8276 2.3839 1.7198 3.1629 1.6360 3.4836 5.0792 3.5152 3.8691 4.1967 3.5735 3.0530 5.0789 5.9246 6.0556 3.5278 5.4206 3.4385 5.5492 3.9309 3.9217 6.8233 4.7843 7.3067 5.2155 5.8404 5.6791 3.9474 4.1412 3.4257 4.9234 1.1229 3.9275 1.3910 4.4572 1.5075 2.2490 1.9347 1.7061 2.2094 1.4554 1.4433 1.3595 3.8765 1.5813 1.3587 1.4010 2.2895 5.1606 2.1297 5.3594 1.5311 2.1442 2.1406 1.5360 1.4668 1.6149 2.0532 1.7021 2.0705 2.3311 2.5969 1.1365 1.6685 2.0748 1.6576 1.3564 3.1799 2.7355 1.5192 3.4196 1.4380 2.8116 1.2062 1.3213 1.2683 3.1737 1.0965 1.5310 1.5030 1.0402 1.1893 1.1013 1.0619 2.2375 1.0728 1.1003 1.0683 5.7710 6.8594 5.8140 6.1926 11.0264 11.9936 1.0362 1.0513 1.0442 1.0358 1.0581 1.0661 1.0923 1.0995 1.1066 1.0990 1.1004 1.0993 1.0985 1.1081 1.1026 1.0885 1.0889 1.0921 1.0953 1.0921 1.0983
irintensity: 0.5619 0.3958 0.1783 0.3332 0.4906 2.2339 0.7031 1.8800 0.3299 3.0319 0.6208 2.2326 0.9376 0.5023 1.0344 11.5797 4.0152 2.3840 1.8935 0.5099 0.7547 0.3729 1.0083 0.5314 12.7505 13.9463 4.9715 2.2120 1.3485 4.1666 4.8100 0.8648 8.6532 0.7391 0.5361 1.2292 1.3279 4.0155 0.2651 2.4069 1.0418 10.8421 1.7334 17.4437 2.4689 1.9718 1.2833 9.4625 2.2128 7.9002 32.1414 12.7497 33.8393 12.5249 4.0150 11.5545 2.8049 2.5180 6.5375 0.6811 3.7542 3.3634 0.5268 1.9856 57.6379 123.8405 6.6518 568.2362 2.2522 102.0339 3.9200 57.4907 5.8593 9.1312 78.8825 60.8324 3.5105 6.1775 421.5000 1.3674 12.6515 306.4534 31.4365 33.1748 0.3135 8.7037 1.4337 48.6961 7.2455 30.9307 25.0383 18.6837 19.9660 24.6471 5.0390 25.3204 4.8059 12.2965 42.0190 42.9340 6.9333 158.6717 8.2257 30.8247 10.5780 12.2195 12.5877 601.7928 29.4802 354.3229 656.1362 33.0153 12.7071 46.8953 24.0153 27.1385 20.9124 38.3225 6.3675 8.5083 76.0034 12.9034 35.7517 35.9791 16.4789 43.2917 6.8576 1.4216 10.7627 9.2007 0.6114 4.4508
temp: 298.150 k
press: 1.00000 atm
elementType: 16 8 8 7 6 6 6 6 6 6 6 6 6 6 6 6 6 6 6 6 6 6 6 6 6 1 1 1 1 1 1 1 1 1 1 1 1 1 1 1 1 1 1 1 1 1
symmnumber: 1
zpe: 956297.4 jmol-1
zpe.correction: 0.364234 hartree
zpe.thermalcorrener: 0.388521 hartree
zpe.thermalcorrenthalpy: 0.389465 hartree
zpe.thermalcorrgfe: 0.306814 hartree
zpe.sumelectzpe: -1414.265454 hartree
zpe.sumelectthermal: -1414.241168 hartree
zpe.sumelectthermalent: -1414.240223 hartree
zpe.sumelectthermalfe: -1414.322874 hartree
dipole: -2.8901 1.7826 -0.5548
dipole: 3.4407
quadrupole: -112.7405 -152.5331 -157.0873
quadrupole: -23.8225 3.0066 -0.1185
quadrupole: 28.0465 -11.7461 -16.3003 -23.8225 3.0066 -0.1185
hfenergy: -1414.6296882 hartree
pointgroup: C01 [X(C21H21N1O2S1)]
dipole: -1.1457151 -0.699192 0.1757085 debye
polarizability: 676.0574883|-31.881408|246.4381613|14.0519358|-2.1521405|134.5192923 unknown
InChI: InChI=1S/C21H21NO2S/c1-4-24-20(23)16-7-9-17(22-14-16)8-5-15-6-10-19-18(13-15)21(2,3)11-12-25-19/h6-7,9-10,13-14H,4,11-12H2,1-3H3
charge 0 multiplicity 1
46 atoms
S  -6.522606 1.714848 -0.050853
O  6.96032 0.395309 0.448753
O  6.806929 -1.932795 0.373206
N  2.855228 0.936739 0.24101
C  -5.383633 -1.352473 0.00797
C  -6.601478 -0.982572 0.915812
C  -4.358855 -0.199203 0.043094
C  -5.840772 -1.572729 -1.466453
C  -4.793529 -2.682713 0.544965
C  -7.492111 0.137224 0.371438
C  -4.781836 1.164779 0.013639
C  -2.968843 -0.448501 0.076107
C  -3.829417 2.218763 0.015237
C  -1.99978 0.595837 0.069131
C  -2.454759 1.946829 0.033762
C  -0.603133 0.304591 0.104732
C  0.615094 0.072447 0.141511
C  2.021589 -0.168902 0.192362
C  2.531634 -1.504438 0.195367
C  4.781412 -0.581934 0.308968
C  3.918277 -1.707959 0.253707
C  4.193204 0.712794 0.297713
C  6.249927 -0.804641 0.376472
C  8.447845 0.270297 0.525753
C  9.001574 1.685984 0.646831
H  -6.229602 -0.713942 1.923308
H  -7.238582 -1.882353 1.032008
H  -6.643567 -2.333267 -1.515352
H  -6.210705 -0.640905 -1.92942
H  -4.991445 -1.930314 -2.075904
H  -3.974598 -3.060564 -0.092263
H  -4.40867 -2.571747 1.575496
H  -5.58049 -3.459198 0.553578
H  -8.012931 -0.171266 -0.548813
H  -8.237969 0.450353 1.120308
H  -2.606629 -1.479364 0.108773
H  -4.17845 3.257272 0.005635
H  -1.725924 2.763093 0.032452
H  1.834953 -2.346305 0.153208
H  4.354431 -2.711981 0.259009
H  4.830998 1.601124 0.336514
H  8.697982 -0.3613 1.397353
H  8.798895 -0.247591 -0.385256
H  10.104752 1.651223 0.705197
H  8.719265 2.296813 -0.227599
H  8.621106 2.181538 1.556234
