program: Gaussian 09
title: 000005312
version: EM64L-G09RevD.01
frameworkgroup: C1[X(C7H10O4)]
method: RPBEPBE
basis: SDD
operation: Freq
keyword: #pfreq=noraman
keyword: PBEPBE/SDD
title: #p freq=noraman PBEPBE/SDD
converged: YES YES NO NO
title: Mulliken charges:
elementType: O O O O C C C C C C C H H H H H H H H H H
charge: -0.205043 -0.411495 -0.196851 -0.240808 -0.508626 -0.484159 0.218011 -0.579228 0.224335 0.190276 -0.758208 0.279701 0.277389 0.284956 0.263466 0.247844 0.253897 0.255429 0.266413 0.243362 0.379340
chargesum: 0.00000
title: Mulliken charges with hydrogens summed into heavy atoms:
elementType: O O O O C C C C C C C
charge: -0.205043 -0.032155 -0.196851 -0.240808 0.048464 0.064263 0.218011 -0.077487 0.224335 0.190276 0.006996
polarizability: 1.09863179e+02 -1.56192278e+00 8.08041032e+01 1.09693777e+00 -3.04245878e+00 7.28124951e+01
1716.lowfreq: -14.1014 -6.9253 -0.0012 -0.0008 -0.0005 3.2854 19.7371 35.6713 39.8189
frequency: 19.2257 35.6541 39.7941 58.5840 85.3471 126.0797 153.1893 164.8429 257.6073 290.2071 383.1256 449.4081 478.8941 480.8663 511.0838 559.1314 580.4318 633.6649 650.5388 758.8306 803.3510 825.6867 901.2099 912.5822 974.4010 993.9881 1032.6494 1051.9189 1073.9945 1100.4225 1152.2062 1157.5377 1217.2546 1233.9196 1244.9512 1256.0834 1330.8269 1373.4670 1376.4942 1435.8183 1441.1381 1446.7236 1449.3906 1452.1060 1615.9756 1643.1071 1662.5281 2970.8535 2980.5872 2996.3658 3023.8094 3034.7058 3062.5617 3075.5349 3116.5983 3126.4389 3514.1538
redmass: 5.9154 10.5424 3.7907 4.0875 3.5164 4.5855 1.0761 2.7103 6.6728 4.8184 2.3042 3.3007 3.4964 2.5606 2.2310 2.9675 3.6438 2.9135 1.4443 2.4028 2.6659 3.8060 2.1874 2.4432 1.9114 1.9723 2.0669 2.8182 1.9490 1.9781 1.7442 1.4529 1.3065 1.5261 1.5825 1.4047 1.7945 1.2544 2.0123 1.0963 1.0820 1.0870 1.0526 1.0843 8.0149 7.8969 8.1026 1.0633 1.0374 1.0659 1.0949 1.0566 1.0958 1.0944 1.1075 1.1007 1.0639
irintensity: 3.2224 3.6507 3.4203 4.2540 4.9426 5.9020 0.3640 8.6346 0.4116 0.2477 7.2872 21.9805 2.4980 10.1612 73.0662 5.7567 26.3955 1.7754 127.2883 2.1456 18.8506 5.0183 12.9724 16.4679 3.5774 19.8339 30.9594 91.8304 197.8824 16.2719 183.7409 43.4749 142.6070 18.4322 24.7244 5.5109 135.6863 67.3495 16.8429 15.7205 38.6968 70.1921 20.6247 2.9146 233.9751 29.8710 194.7055 15.4187 1.7041 25.1461 1.4477 4.2733 4.1489 4.6970 6.6037 9.6172 25.6509
temp: 298.150 k
press: 1.00000 atm
elementType: 8 8 8 8 6 6 6 6 6 6 6 1 1 1 1 1 1 1 1 1 1
symmnumber: 1
zpe: 423345.5 jmol-1
zpe.correction: 0.161244 hartree
zpe.thermalcorrener: 0.173748 hartree
zpe.thermalcorrenthalpy: 0.174692 hartree
zpe.thermalcorrgfe: 0.119306 hartree
zpe.sumelectzpe: -572.790810 hartree
zpe.sumelectthermal: -572.778305 hartree
zpe.sumelectthermalent: -572.777361 hartree
zpe.sumelectthermalfe: -572.832747 hartree
dipole: -0.8880 0.7441 0.2631
dipole: 1.1881
quadrupole: -52.0979 -76.2675 -65.8049
quadrupole: -4.2575 -6.8872 0.2710
quadrupole: 12.6256 -11.5441 -1.0815 -4.2575 -6.8872 0.2710
hfenergy: -572.9520534 hartree
pointgroup: C01 [X(C7H10O4)]
dipole: 0.3705457 -0.2467236 0.1424939 debye
dipolederiv: -0.6435993 0.0556064 -0.0661457 -0.1350227 -0.9263662 -0.0233371 -0.1822273 -0.178112 -0.3045216 -0.7925127 -0.2149754 -0.5325869 -0.170971 -0.4467869 -0.1073268 -0.5150298 -0.1231474 -0.8286516 -0.4668026 0.1495921 0.0475688 -0.0770963 -0.8700306 0.1934362 0.2329499 0.2725836 -0.4626142 -0.7580137 0.1251401 0.1707525 0.0262813 -0.4446809 -0.2710726 -0.0628977 -0.2292412 -0.8170508 -0.3715523 0.1616258 -0.0546413 0.2838768 -0.138144 -0.0038243 0.043888 -0.0816804 0.0744705 -0.363091 0.0726389 -0.0041833 0.2898112 0.0100421 -0.0731399 0.0715413 -0.0751566 0.0313839 1.3064384 0.0791653 0.1791365 0.2042763 1.0500265 0.0855599 0.5188048 0.3581943 0.1064233 -0.8663674 -0.5232679 0.1734681 -0.4630057 -0.2911368 0.0914975 0.2028388 0.1276027 -0.1763082 0.8899148 -0.1644848 -0.3919441 0.0074511 0.961934 -0.3103733 -0.8574826 -0.5285901 0.5944296 1.4663288 -0.0571479 0.2341926 -0.0804051 0.4392153 0.4718207 0.3489689 0.4486316 1.2593679 -0.3398279 0.2121421 0.1266949 0.2402165 -0.1946843 -0.0513616 0.1494842 -0.0140773 -0.0257065 0.1724445 0.0195463 0.0381348 -0.0505554 0.1204928 -0.0209899 -0.0464429 -0.0135404 -0.0255109 0.0772537 -0.0568262 0.0058903 -0.0714699 0.0047619 0.0134291 -0.0620224 0.0496114 0.0798086 0.1698777 0.0182351 0.0234987 -0.107435 0.0007609 0.0033911 0.0152901 0.0401107 0.1144837 0.0540354 -0.0067097 0.0156216 -0.0512119 0.1107924 0.0240688 -0.0042923 0.0110998 -0.0607046 0.0201564 0.0597483 -0.0774585 0.0732335 0.0374905 0.0528428 -0.0620458 0.0209013 0.0493443 0.0751257 0.0691878 0.0574715 0.0585384 0.0188222 -0.0672345 0.0385479 -0.03932 0.0335873 0.0615235 -0.0058899 0.0613862 -0.01592 0.0771122 0.0787693 0.109456 0.0553554 -0.0321479 0.1072054 -0.0829551 -0.0199102 -0.0416754 -0.0024983 -0.0185811 0.0360494 -0.0195731 0.1153487 0.0261077 0.0237941 -0.0652655 -0.0127355 0.1319551 -0.0078323 -0.0965423 -0.0139328 -0.009807 0.1753548 0.0658347 0.0783192 0.0938187 0.3509222 -0.059742 0.1211639 -0.0677197 0.2843755 unknown
polarizability: 109.8633406|1.4663349|81.0659799|1.2585979|2.645338|72.5504572 unknown
InChI: InChI=1S/C7H10O4/c1-5(8)4-6(9)2-3-7(10)11/h10H,2-4H2,1H3
charge 0 multiplicity 1
21 atoms
O  0.917027 -1.649332 0.485321
O  -3.801965 -0.415411 -1.155429
O  2.382873 2.126431 -0.237344
O  -3.416403 0.511414 0.936688
C  -0.548033 0.317015 0.545204
C  -1.532954 -0.442782 -0.356667
C  0.75131 -0.438011 0.788026
C  1.89689 0.387679 1.403007
C  2.70978 1.010635 0.242361
C  -2.9701 -0.046993 -0.090976
C  3.857133 0.173555 -0.29002
H  -1.022133 0.509476 1.53125
H  -0.302901 1.319857 0.143128
H  -1.435285 -1.531606 -0.170761
H  -1.30994 -0.302726 -1.42797
H  2.533823 -0.283636 2.001553
H  1.491656 1.205993 2.020624
H  4.249752 0.600917 -1.22517
H  3.523066 -0.868545 -0.452339
H  4.670849 0.13367 0.459839
H  -4.743444 -0.177501 -0.934225
