program: Gaussian 09
title: 000040687
version: EM64L-G09RevD.01
frameworkgroup: C1[X(C22H20N4O3S)]
method: RPBEPBE
basis: SDD
operation: Freq
keyword: #p
keyword: freq=noraman
keyword: PBEPBE/SDD
title: #p freq=noraman PBEPBE/SDD
converged: YES YES NO NO
title: Mulliken charges:
elementType: S O O O N N N N C C C C C C C C C C C C C C C C C C C C C C H H H H H H H H H H H H H H H H H H H H
charge: 0.982129 -0.542419 -0.535991 -0.249948 -0.499836 -0.043684 -0.454027 -0.499104 0.223249 0.257186 0.234430 -0.056125 -0.096458 -0.336473 -0.601679 0.452814 -0.386688 0.508932 -0.388382 -0.313032 -0.260505 -0.447727 -0.319523 -0.232542 0.280665 -0.287758 -0.367045 0.222838 -0.763094 -0.779992 0.310439 0.269214 0.260814 0.226176 0.315684 0.266592 0.231569 0.235597 0.272371 0.234883 0.288261 0.229593 0.311366 0.273437 0.262510 0.296266 0.277247 0.261301 0.261432 0.215035
chargesum: 0.00000
title: Mulliken charges with hydrogens summed into heavy atoms:
elementType: S O O O N N N N C C C C C C C C C C C C C C C C C C C C C C
charge: 0.982129 -0.542419 -0.535991 -0.249948 -0.189397 -0.043684 -0.142660 -0.225667 0.223249 0.257186 0.234430 -0.056125 -0.096458 -0.067258 -0.340864 0.452814 -0.160513 0.508932 -0.072698 -0.046440 -0.028936 -0.212130 -0.047152 0.002341 0.280665 0.000503 -0.137452 0.222838 0.072929 -0.042223
polarizability: 5.72017101e+02 2.55762273e+01 4.73476518e+02 -1.12670176e+01 -2.35615047e+00 1.99745212e+02
1716.lowfreq: -3.6243 0.0005 0.0007 0.0009 1.2712 3.1813 14.6091 16.5926 22.1721
frequency: 14.5067 16.5754 22.1355 37.4025 39.2668 47.1749 50.0356 57.3469 77.0696 97.6661 104.4325 114.8027 123.3155 131.6869 149.5868 151.4740 179.5421 189.0261 211.3386 223.0879 241.2120 245.9871 279.0278 288.9765 307.8717 321.8809 343.1900 358.0601 366.5033 395.2047 400.4450 414.9994 421.0247 428.2578 453.7752 474.9663 494.4250 503.4524 527.2267 530.9364 540.4138 549.9898 572.7456 588.8947 591.8753 624.0226 629.3481 634.2451 647.2013 678.1304 686.7258 708.3124 726.0620 741.9232 763.2841 777.0448 788.4112 795.2590 806.6386 813.0120 828.3276 830.6228 846.4218 848.8739 862.9341 875.0604 890.3370 891.4285 901.8982 925.0680 947.3491 950.1872 963.5350 963.8884 975.9631 995.0949 995.6379 998.3360 1003.8316 1005.3556 1021.3223 1039.9170 1082.9535 1117.0805 1122.0898 1158.0990 1175.4871 1181.2130 1193.1223 1197.5081 1220.4316 1236.1112 1243.9628 1261.6201 1274.4998 1280.9058 1286.9471 1309.0373 1319.3958 1337.9705 1363.5826 1376.7399 1389.4126 1393.5503 1408.4732 1412.8938 1415.4325 1436.2779 1437.3725 1448.8118 1451.9114 1469.4254 1471.9961 1483.2862 1496.0698 1499.2152 1535.3098 1552.1629 1559.4506 1573.9323 1611.3482 1614.1187 1627.4054 1638.9325 2997.0482 3029.4748 3098.1443 3100.6825 3119.3293 3123.9496 3124.4006 3138.6689 3138.9705 3156.4915 3164.0957 3167.5314 3171.7121 3179.2309 3179.3956 3184.0430 3195.3609 3351.5352 3518.9615 3531.1663
redmass: 5.4206 7.9475 5.2639 4.9377 3.0717 2.8381 1.9124 3.5649 4.3266 5.5166 4.4097 4.5458 4.7167 4.9659 1.4126 3.1162 5.8213 4.9860 6.0243 5.0409 5.1262 4.8046 5.2222 5.0856 6.1285 6.5981 5.0464 4.3521 7.3621 4.2057 3.7543 3.6908 3.1698 4.5233 4.5667 2.8002 1.6802 5.7778 2.5889 4.6965 3.4494 5.3352 6.0501 3.3832 5.5311 6.1981 4.0305 2.4748 5.5079 1.7270 5.9645 4.9529 3.8910 3.3370 2.0633 2.4639 5.8323 2.8421 3.1137 1.6439 2.7529 2.2664 1.5257 1.6573 4.1155 1.8214 1.7311 2.1814 4.8564 6.4842 1.3219 1.3463 1.3589 1.3639 3.0276 1.3631 2.5876 1.6455 1.3341 2.3186 2.1140 1.6346 4.1113 1.4261 1.9069 1.2978 1.3855 1.2164 1.8574 1.1853 1.7524 1.8716 2.5785 2.1508 1.9308 1.1398 4.3641 2.0061 1.8510 2.1258 2.8104 3.8149 1.5646 2.5853 1.0590 2.9103 1.0632 3.7280 5.2251 1.0466 2.9652 1.1819 2.2601 2.5884 2.9654 3.3180 5.1033 5.6569 5.5523 3.6264 5.9529 6.1654 5.4027 5.9756 1.0362 1.0239 1.0992 1.0994 1.0898 1.0904 1.0858 1.0918 1.0891 1.0949 1.0895 1.0939 1.0996 1.0962 1.1062 1.1080 1.0959 1.0752 1.0749 1.0764
irintensity: 3.8012 1.2541 2.0534 2.3540 0.3518 3.6056 1.5354 9.5143 0.7486 13.8741 0.8472 5.7876 4.9225 26.4548 4.4636 51.2334 27.6586 4.9515 11.9629 4.3724 0.8397 5.9969 5.3283 2.6493 9.1608 37.5075 2.1126 2.8612 10.7226 24.8327 19.9731 7.8508 3.1955 9.4008 15.3338 10.1954 284.9585 0.4441 16.7809 30.0271 17.4807 18.7729 7.7951 0.7327 7.8540 17.1806 2.7640 45.4780 13.8386 19.8750 6.5917 16.0235 4.5197 2.5616 48.8487 28.2425 1.9655 2.6144 52.4473 62.9338 47.3418 62.6002 64.2346 30.0985 10.6032 0.0591 48.5536 16.7415 3.2987 6.1530 123.1404 41.9178 0.7170 1.6179 8.4168 0.3347 0.5892 19.4915 4.7800 42.7846 9.2115 14.8398 9.0596 20.2753 1.4180 10.0848 1.2398 45.8047 8.8786 1.6595 115.2165 16.8290 6.1033 37.0275 28.2731 8.6656 30.4508 108.2379 74.7717 142.5949 49.5895 253.5711 111.4044 9.2749 6.0863 190.9877 20.1264 28.3775 265.7548 16.8437 93.0328 31.4060 209.7117 196.2084 62.4702 386.3801 23.7778 81.2495 62.1145 31.7928 179.9468 305.1245 155.0137 113.0231 12.9099 0.7819 11.8186 11.8962 12.8928 10.5896 2.6310 17.4184 10.9537 21.9041 7.5834 7.9993 33.5994 0.7694 0.1115 1.2105 15.3191 12.1909 31.7311 13.5141
temp: 298.150 k
press: 1.00000 atm
elementType: 16 8 8 8 7 7 7 7 6 6 6 6 6 6 6 6 6 6 6 6 6 6 6 6 6 6 6 6 6 6 1 1 1 1 1 1 1 1 1 1 1 1 1 1 1 1 1 1 1 1
symmnumber: 1
zpe: 989285.2 jmol-1
zpe.correction: 0.376799 hartree
zpe.thermalcorrener: 0.404984 hartree
zpe.thermalcorrenthalpy: 0.405928 hartree
zpe.thermalcorrgfe: 0.314200 hartree
zpe.sumelectzpe: -1690.833622 hartree
zpe.sumelectthermal: -1690.805437 hartree
zpe.sumelectthermalent: -1690.804493 hartree
zpe.sumelectthermalfe: -1690.896220 hartree
dipole: 7.5421 3.9629 -3.5597
dipole: 9.2336
quadrupole: -216.2990 -176.5976 -176.2933
quadrupole: -32.5632 6.8917 11.8093
quadrupole: -26.5690 13.1324 13.4367 -32.5632 6.8917 11.8093
hfenergy: -1691.2104209 hartree
pointgroup: C01 [X(C22H20N4O3S1)]
dipole: 2.585528 -2.2529267 1.1985346 debye
polarizability: 557.9091346|-43.903213|485.4228533|8.9914283|24.2281816|201.9068432 unknown
InChI: InChI=1S/C22H20N4O3S/c1-14(27)23-17-11-12-19-21(13-17)25-20-6-4-3-5-18(20)22(19)24-15-7-9-16(10-8-15)26-30(2,28)29/h3-13,23-24,26H,1-2H3
charge 0 multiplicity 1
50 atoms
S  -6.256132 2.245937 0.631601
O  -7.054506 3.491624 1.307127
O  -6.78179 1.520846 -0.72512
O  4.167221 4.075796 -0.038308
N  -0.679987 -1.117733 -1.269545
N  3.024129 -2.488972 0.457486
N  4.882338 1.943817 0.653668
N  -4.380479 2.923815 0.21334
C  0.534073 -1.531498 -0.663412
C  1.591173 -0.615286 -0.367201
C  0.73176 -2.930212 -0.414976
C  2.812934 -1.15253 0.228096
C  2.01854 -3.358161 0.124973
C  1.554334 0.789489 -0.672246
C  3.876919 -0.253998 0.561886
C  -1.56937 -0.105774 -0.854112
C  -0.280966 -3.924333 -0.649617
C  3.785844 1.114876 0.291076
C  2.606958 1.63958 -0.35837
C  2.247642 -4.762328 0.343196
C  -0.025479 -5.275021 -0.41946
C  -2.641047 0.258981 -1.724165
C  -1.462295 0.533548 0.415248
C  1.256624 -5.699802 0.068952
C  -3.454002 1.899132 -0.088448
C  -3.563143 1.246529 -1.354317
C  -2.404603 1.501795 0.795059
C  5.038959 3.326466 0.48983
C  -6.110831 0.845396 1.958679
C  6.367161 3.877115 1.004229
H  -1.028895 -1.725473 -2.014297
H  0.677373 1.206883 -1.173954
H  4.767341 -0.697937 1.021574
H  -1.279654 -3.617244 -0.980706
H  2.568496 2.703522 -0.597615
H  3.227524 -5.04993 0.736097
H  -0.809913 -6.018673 -0.596694
H  -2.728926 -0.223932 -2.705223
H  -0.65884 0.254653 1.102394
H  1.443041 -6.765638 0.239713
H  -4.371803 1.544237 -2.027796
H  -2.320768 1.974997 1.782151
H  5.663612 1.455015 1.096902
H  -4.153788 3.452219 1.079792
H  -5.791345 1.328363 2.892117
H  -7.121603 0.420411 2.031374
H  -5.380567 0.120464 1.573817
H  6.161685 4.666901 1.746875
H  6.905819 4.351737 0.165876
H  7.023829 3.118134 1.463754
