program: Gaussian 09
title: 000034672
version: EM64L-G09RevD.01
frameworkgroup: C1[X(C10H16)]
method: RPBEPBE
basis: SDD
operation: Freq
keyword: #p
keyword: freq=noraman
keyword: PBEPBE/SDD
title: #p freq=noraman PBEPBE/SDD
converged: YES YES NO NO
title: Mulliken charges:
elementType: C C C C C C C C C C H H H H H H H H H H H H H H H H
charge: -0.508042 0.426192 -0.688969 -0.368152 -0.823978 -0.200065 -0.341468 0.515148 -0.822834 -0.731647 0.216291 0.202161 0.218484 0.218500 0.226245 0.219122 0.233658 0.222577 0.228552 0.226239 0.218758 0.226539 0.225379 0.226604 0.216036 0.218670
chargesum: 0.00000
title: Mulliken charges with hydrogens summed into heavy atoms:
elementType: C C C C C C C C C C
charge: -0.089591 0.426192 -0.025741 -0.149030 -0.139191 0.026174 -0.122710 0.515148 -0.144311 -0.296941
polarizability: 2.37056940e+02 2.69387525e+01 1.04856337e+02 -5.30457089e+00 9.07857084e-01 6.70445172e+01
1716.lowfreq: -16.9995 -9.4513 -1.5092 -0.0009 -0.0004 -0.0003 42.2284 56.2964 72.5060
frequency: 41.5361 56.2609 72.4949 95.6937 115.4353 182.6747 199.4102 219.5911 232.0637 266.8802 282.8711 339.5053 405.8790 426.2908 475.3520 524.5653 540.2464 585.7525 683.1700 779.8612 782.8937 852.4329 864.5666 903.1111 925.0605 946.5718 970.9683 981.3514 1004.2272 1017.4893 1020.1586 1047.9604 1068.6973 1081.1545 1171.9510 1200.4598 1246.7397 1269.1978 1300.7646 1312.3563 1332.0031 1368.1603 1385.1094 1391.9759 1397.1513 1425.9845 1457.8287 1465.5417 1468.1927 1473.1517 1479.8446 1481.0733 1487.8190 1597.3103 1630.8340 1651.4044 2953.4933 2965.9334 2973.2564 2980.9987 3027.5392 3033.6731 3050.6468 3073.7543 3077.3159 3081.9442 3083.2482 3091.1676 3092.5327 3094.2018 3118.3937 3197.9681
redmass: 2.6501 2.7659 2.0681 2.4952 1.3921 1.0599 1.7680 1.9154 2.4293 1.7751 3.1838 2.3762 2.3718 2.8633 2.4616 2.3924 2.5685 3.0721 1.0736 1.4891 2.0422 3.1423 1.5608 1.6249 1.3228 1.8389 1.1417 1.4016 1.6281 1.5300 1.5719 1.5406 1.8020 1.6701 2.6653 1.6548 1.2023 1.3698 1.4248 1.6072 3.0932 1.4890 1.2292 1.2679 1.2744 1.2778 1.0676 1.0698 1.0469 1.0720 1.0536 1.0627 1.0603 4.6159 4.8111 5.7135 1.0634 1.0393 1.0373 1.0349 1.0966 1.0962 1.0974 1.0896 1.0991 1.0904 1.1005 1.0953 1.0648 1.0959 1.0876 1.1140
irintensity: 0.0858 0.2456 0.8631 0.6218 0.2999 1.0599 0.2473 0.0919 0.1177 0.0475 1.0434 1.1109 0.3324 1.9602 5.0114 4.6481 3.4655 12.6061 0.0059 3.9043 3.3909 0.2995 9.3105 1.5243 43.3044 3.9565 97.2041 1.5713 5.7014 1.1713 2.7398 4.7046 31.7153 1.8167 0.2500 0.3590 0.6321 8.3000 0.0141 9.6137 22.1099 11.9965 7.3641 26.8142 19.5788 0.4339 4.2035 16.8984 15.1113 16.8995 9.3149 22.8244 5.4204 20.4553 27.0016 18.3757 47.7908 44.5353 22.9654 55.3107 13.2905 26.5141 24.8923 3.4894 62.5895 21.8364 50.3290 24.2948 6.9607 22.5600 36.2711 22.8336
temp: 298.150 k
press: 1.00000 atm
elementType: 6 6 6 6 6 6 6 6 6 6 1 1 1 1 1 1 1 1 1 1 1 1 1 1 1 1
symmnumber: 1
zpe: 597433.6 jmol-1
zpe.correction: 0.227550 hartree
zpe.thermalcorrener: 0.240179 hartree
zpe.thermalcorrenthalpy: 0.241124 hartree
zpe.thermalcorrgfe: 0.188278 hartree
zpe.sumelectzpe: -389.838187 hartree
zpe.sumelectthermal: -389.825558 hartree
zpe.sumelectthermalent: -389.824614 hartree
zpe.sumelectthermalfe: -389.877459 hartree
dipole: 1.1924 0.6781 0.0478
dipole: 1.3726
quadrupole: -59.0066 -58.6644 -67.5021
quadrupole: -1.0431 -0.9231 0.5952
quadrupole: 2.7178 3.0599 -5.7777 -1.0431 -0.9231 0.5952
hfenergy: -390.0657373 hartree
pointgroup: C01 [X(C10H16)]
dipole: 0.4684914 -0.2592472 -0.0701914 debye
dipolederiv: -0.0135198 -0.0536872 0.0253014 0.1110559 0.0524502 -0.0194927 0.1479489 -0.0491328 0.1062367 0.4427927 -0.0209266 0.0096976 -0.2981166 0.2947931 0.0799122 -0.0434659 0.1312066 -0.126924 -0.0337723 -0.0085187 0.0641522 -0.1133382 0.0880454 0.0033574 -0.0879253 0.003956 0.0143929 -0.3257542 0.0236936 0.026724 0.1852987 -0.0300318 0.059379 0.0400575 0.0396218 -0.1663095 -0.0944157 0.0159488 0.0014679 -0.0477449 -0.1414484 -0.0666994 0.0356655 -0.0958003 0.0668536 0.2729492 -0.0405999 0.0140414 0.1105238 0.0415771 0.0541208 0.0563213 0.0462066 -0.1278921 -0.1663729 -0.0116711 0.0087906 -0.0500553 0.0590088 0.066462 -0.02011 0.0668811 -0.1744515 0.46177 -0.0503007 0.0107417 0.230999 0.2450305 0.0732218 0.0931695 0.0616091 0.0172445 -0.0041856 -0.0061772 -0.0060735 -0.0687755 -0.133988 -0.061048 -0.0242741 -0.0579181 0.0697213 -0.4126658 0.1665906 0.0552031 0.0658076 -0.0836435 0.1049535 0.0203815 0.1102751 -0.4363328 0.0338954 0.0629599 0.0519368 -0.0219695 -0.1389088 -0.0955036 0.0256871 -0.0644857 0.0359569 -0.1221404 0.0415609 -0.0858284 0.0251607 0.0250174 0.1174507 -0.1338914 0.0818484 -0.079279 -0.2155451 -0.1150591 -0.0115208 -0.1577265 0.02378 -0.0174874 -0.0047087 -0.0368716 0.0645175 0.0969286 0.0469099 0.025773 0.1097551 -0.1317289 -0.0857435 0.0402145 -0.0530995 0.0391241 0.0664863 0.0650221 -0.0993075 0.0483934 0.0411428 0.0869853 -0.0287505 0.0826503 -0.0793896 0.0270284 0.0113175 -0.0073898 -0.0720852 -0.1177657 -0.0725962 -0.025413 -0.0663409 0.1264616 0.0535194 0.0327448 0.0989462 0.103958 0.0522607 -0.004685 0.1553856 -0.0573324 -0.0900731 -0.0235111 0.1013863 -0.10649 0.136328 0.0140464 0.0304554 -0.1400882 0.0951901 0.0004697 -0.0584092 -0.1585026 -0.0015178 -0.0892233 0.0192848 -0.0098947 -0.0145435 0.0019297 0.0981486 0.0845227 -0.0049382 -0.0060751 -0.0735824 -0.0945131 -0.0678819 -0.0138426 -0.0662342 0.1333081 0.0177238 -0.0261661 -0.0167321 -0.0677006 -0.1117511 -0.0740256 -0.0265479 -0.07299 0.1360184 0.0703081 0.0816759 -0.0829787 0.0367577 -0.0314264 0.0657403 -0.0512851 0.0998759 -0.0188851 -0.1654824 -0.0964015 -0.0415212 -0.0064506 0.0718943 -0.010154 -0.0195424 -0.0159768 0.1037262 0.0483729 0.0384033 0.1265003 0.0101446 0.0399503 -0.0346754 0.0771151 -0.0638617 -0.0692317 -0.11326 -0.041687 -0.0305424 -0.0795447 0.0547458 -0.0398403 -0.0412159 -0.0371804 0.1749802 0.0727372 -0.0535778 -0.0232988 -0.0278693 -0.1078219 -0.0823107 -0.0163421 -0.0840261 0.181608 unknown
polarizability: 237.068056|-27.3197061|103.3742759|-1.3327819|7.6476081|68.5154631 unknown
InChI: InChI=1S/C10H16/c1-5-10(4)8-6-7-9(2)3/h6-8H,2,5H2,1,3-4H3
charge 0 multiplicity 1
26 atoms
C  3.292077 0.533272 0.493725
C  1.989028 -0.208565 0.225906
C  4.235185 0.605819 -0.738501
C  0.784666 0.45217 0.319009
C  2.127275 -1.673984 -0.143859
C  -0.544197 -0.094266 0.085781
C  -1.699957 0.646406 0.198707
C  -3.062779 0.150595 -0.024672
C  -3.263788 -1.305781 -0.415176
C  -4.133925 0.994871 0.118992
H  3.068809 1.5609 0.837735
H  3.838061 0.03043 1.320496
H  5.149335 1.177241 -0.494066
H  4.548789 -0.400154 -1.071168
H  3.73347 1.105397 -1.586902
H  0.814528 1.517143 0.598808
H  2.5754 -1.791036 -1.150396
H  2.804161 -2.190402 0.564911
H  1.165182 -2.210775 -0.144891
H  -0.622068 -1.151644 -0.198794
H  -1.614569 1.707402 0.480341
H  -2.856534 -1.986234 0.356863
H  -4.33424 -1.53712 -0.544394
H  -2.745505 -1.540188 -1.364634
H  -5.16309 0.655112 -0.040136
H  -3.998713 2.046491 0.400112
