program: Gaussian 09
title: 000034703
version: EM64L-G09RevD.01
frameworkgroup: C1[X(C9H6Cl9N3O3)]
method: RPBEPBE
basis: SDD
operation: Freq
keyword: #p
keyword: freq=noraman
keyword: PBEPBE/SDD
title: #p freq=noraman PBEPBE/SDD
converged: YES YES NO NO
title: Mulliken charges:
elementType: Cl Cl Cl Cl Cl Cl Cl Cl Cl O O O N N N C C C C C C C C C H H H H H H
charge: 0.103311 0.127301 0.127228 0.098516 0.127037 0.133102 0.101311 0.123092 0.125531 -0.181862 -0.175245 -0.172305 -0.158482 -0.074267 0.025983 -0.099739 -0.101508 -0.097884 0.125136 0.087440 0.028623 -0.641895 -0.642010 -0.644981 0.274080 0.274778 0.272649 0.273174 0.279987 0.281902
chargesum: 0.00000
title: Mulliken charges with hydrogens summed into heavy atoms:
elementType: Cl Cl Cl Cl Cl Cl Cl Cl Cl O O O N N N C C C C C C C C C
charge: 0.103311 0.127301 0.127228 0.098516 0.127037 0.133102 0.101311 0.123092 0.125531 -0.181862 -0.175245 -0.172305 -0.158482 -0.074267 0.025983 0.449118 0.444314 0.464004 0.125136 0.087440 0.028623 -0.641895 -0.642010 -0.644981
polarizability: 2.78631989e+02 -8.06545574e-01 2.26244791e+02 2.48756267e+00 1.06683467e+00 1.73753982e+02
1716.lowfreq: -3.1008 -0.9575 -0.0014 0.0010 0.0020 2.2355 10.7301 14.2044 15.4647
frequency: 10.4606 14.0145 15.2804 20.5797 30.5895 32.9960 33.5767 40.5657 81.6212 101.5948 104.5455 117.7739 125.8308 143.0818 155.0933 176.8719 204.5114 211.0199 216.2380 217.5110 227.9952 235.8405 241.6507 252.9545 257.5765 273.4372 300.0670 332.9211 333.7321 335.0749 343.4038 346.6065 352.1718 424.1251 433.3043 511.3041 522.7666 539.4653 561.3075 604.3268 638.8401 650.7177 651.9712 655.3563 678.0023 694.3593 696.7631 738.8530 739.1672 783.0598 785.5091 886.9790 898.5506 933.3603 967.4960 1019.9559 1023.3323 1025.9629 1051.7959 1071.8988 1104.0041 1108.0566 1114.3031 1222.2143 1223.1742 1224.9013 1249.2108 1290.8717 1299.9848 1341.8211 1363.0931 1373.7770 1425.4878 1429.7118 1435.1538 1443.2735 1460.1523 1504.2256 3029.5074 3030.3560 3035.4319 3103.6229 3103.9088 3109.1447
redmass: 17.4488 21.1318 19.4248 20.6095 23.0824 15.1767 25.3129 14.1453 17.2627 20.4578 10.4556 21.5690 9.9980 24.1347 11.8031 17.5880 11.6795 18.3296 18.6517 14.3436 14.0390 8.1687 8.3007 8.3886 24.2491 21.0934 16.5163 2.8961 2.8428 2.8553 19.5026 19.7942 20.9191 8.4828 9.5653 8.5231 7.7942 8.0720 10.5152 8.6781 10.0638 5.0089 5.0432 5.1168 8.4104 12.2033 12.1786 12.5997 12.0953 11.8279 12.6356 12.9702 10.3934 10.5473 10.4456 1.8101 1.8058 1.7976 11.0978 10.7582 5.1712 5.5062 5.4754 1.0725 1.0710 1.0729 11.3678 4.2903 2.7905 1.4571 1.6537 2.2365 1.7545 1.1491 1.1259 1.9834 4.7722 8.6835 1.0562 1.0563 1.0567 1.1080 1.1082 1.1082
irintensity: 0.4235 0.0060 0.5333 0.0574 0.4379 0.0012 0.0145 0.0092 0.1257 0.4016 2.5037 0.1906 0.0109 0.1481 0.0474 0.9261 0.6776 0.1935 0.4249 0.4962 0.1538 0.0270 0.3589 7.1745 0.1172 1.2390 4.0918 0.3487 3.7060 3.3259 3.3728 4.3129 0.0908 3.1963 4.8243 62.7076 34.6524 33.3583 1.3477 58.9538 75.9581 32.0815 84.9496 265.4710 23.3433 0.0577 0.5989 262.8120 33.1665 113.4800 21.2285 2.6412 10.5329 9.6120 0.5010 39.8515 3.0030 82.1388 239.1315 380.2928 23.1491 11.6051 16.1007 0.5673 18.7155 37.6935 69.7184 970.3106 585.0220 1.4005 33.5151 26.2309 323.3643 66.7242 16.8823 150.4549 255.0814 971.8418 4.5023 14.3942 9.4540 2.8513 1.1863 0.8443
temp: 298.150 k
press: 1.00000 atm
elementType: 17 17 17 17 17 17 17 17 17 8 8 8 7 7 7 6 6 6 6 6 6 6 6 6 1 1 1 1 1 1
symmnumber: 1
zpe: 407335.1 jmol-1
zpe.correction: 0.155146 hartree
zpe.thermalcorrener: 0.181702 hartree
zpe.thermalcorrenthalpy: 0.182647 hartree
zpe.thermalcorrgfe: 0.089816 hartree
zpe.sumelectzpe: -4875.146752 hartree
zpe.sumelectthermal: -4875.120195 hartree
zpe.sumelectthermalent: -4875.119251 hartree
zpe.sumelectthermalfe: -4875.212082 hartree
dipole: -2.4907 2.7241 -0.1260
dipole: 3.6932
quadrupole: -206.6162 -224.7784 -195.0284
quadrupole: 1.4214 1.0150 0.0786
quadrupole: 2.1915 -15.9707 13.7793 1.4214 1.0150 0.0786
hfenergy: -4875.3018976 hartree
pointgroup: C01 [X(C9H6Cl9N3O3)]
dipole: -1.0009246 -1.052385 0.0434575 debye
polarizability: 278.6693724|-0.2236296|226.2330723|-1.8353366|1.1186871|173.7283177 unknown
InChI: InChI=1S/C9H6Cl9N3O3/c10-7(11,12)1-22-4-19-5(23-2-8(13,14)15)21-6(20-4)24-3-9(16,17)18/h1-3H2
charge 0 multiplicity 1
30 atoms
Cl -3.637423 -4.646792 -0.018245
Cl -1.007984 -4.948548 1.462875
Cl -1.040314 -4.892444 -1.565519
Cl -5.653505 2.423792 0.013183
Cl -3.580626 3.888499 -1.649772
Cl -3.590756 4.187871 1.364245
Cl 6.504866 -0.689331 -0.056436
Cl 5.462217 1.646302 1.572735
Cl 5.48956 1.803906 -1.452081
O  -0.31775 -2.316968 -0.011801
O  -1.6031 2.213651 0.051291
O  2.85331 1.079126 -0.006034
N  -1.057753 -0.079509 0.029663
N  1.291697 -0.674744 -0.012715
N  0.630903 1.673599 0.024448
C  -1.745093 -2.685978 -0.002551
C  -3.009036 1.772447 0.078672
C  3.872708 0.010268 -0.041448
C  -0.03159 -0.976198 0.002943
C  -0.648318 1.229963 0.035379
C  1.548264 0.667455 0.002446
C  -1.816023 -4.213521 -0.029745
C  -3.87901 3.024758 -0.041989
C  5.240787 0.690501 0.00391
H  -2.25331 -2.271676 -0.890588
H  -2.23354 -2.303799 0.910607
H  -3.225734 1.256681 1.030658
H  -3.217704 1.090854 -0.763711
H  3.77277 -0.578139 -0.969762
H  3.754086 -0.661025 0.826145
