program: Gaussian 09
title: 000005343
version: EM64L-G09RevD.01
frameworkgroup: C1[X(C12H14N4O2S)]
method: RPBEPBE
basis: SDD
operation: Freq
keyword: #p
keyword: freq=noraman
keyword: PBEPBE/SDD
title: #p freq=noraman PBEPBE/SDD
converged: NO YES NO NO
title: Mulliken charges:
elementType: S O O N N N N C C C C C C C C C C C C H H H H H H H H H H H H H H
charge: 0.987052 -0.551285 -0.490255 -0.662112 -0.073307 -0.074604 -0.687645 -0.091524 0.346333 -0.225109 -0.141003 -0.434798 -0.392168 -0.414968 0.516329 0.247661 -0.006267 -0.778422 -0.759567 0.346170 0.284766 0.286840 0.233917 0.231097 0.231099 0.257790 0.232956 0.229835 0.229177 0.240676 0.250766 0.314997 0.315571
chargesum: 0.00000
title: Mulliken charges with hydrogens summed into heavy atoms:
elementType: S O O N N N N C C C C C C C C C C C C
charge: 0.987052 -0.551285 -0.490255 -0.315942 -0.073307 -0.074604 -0.057077 -0.091524 0.346333 0.059657 0.145837 -0.200880 -0.161071 -0.183870 0.516329 0.247661 -0.006267 -0.057841 -0.038947
polarizability: 2.57049820e+02 -1.43056674e+01 2.03766068e+02 -7.48875610e+00 -1.81635022e+01 1.41783222e+02
1716.lowfreq: -84.0807 -7.5750 -5.9586 -0.0017 0.0005 0.0015 4.5992 19.7392 30.3456
frequency: -84.0535 19.5003 30.2983 52.8155 69.1209 77.4925 83.1705 133.6153 142.6245 166.4879 188.5832 209.8747 218.5015 228.8747 247.5120 281.5838 292.2512 323.6338 386.8423 403.4967 410.0642 412.7472 413.4694 432.3481 448.3859 471.3582 518.2985 533.1861 555.7690 571.3289 598.6403 622.1559 628.8663 647.9049 681.4962 718.9280 764.1532 799.6603 809.5576 814.0769 833.1897 861.6420 919.7982 926.1639 946.1244 951.3501 963.9395 975.0134 979.9238 1022.3026 1022.4929 1043.7202 1050.2812 1057.5454 1067.3205 1132.3513 1169.2497 1185.0729 1227.0852 1286.1133 1303.0402 1323.8384 1353.5537 1380.7493 1387.1347 1394.4665 1400.5696 1429.4360 1436.3653 1450.5862 1460.4419 1465.5296 1468.7500 1489.4000 1515.6836 1554.1069 1585.4230 1613.8651 1649.4189 2987.5278 2993.7089 3067.5317 3074.8973 3121.1042 3131.7989 3134.9372 3137.3436 3151.7804 3164.1590 3182.0874 3515.6174 3561.6249 3700.1767
redmass: 1.0211 5.1340 3.8564 4.0232 7.3133 1.0298 5.6875 7.2515 4.6505 4.9484 3.5172 7.7089 6.9854 8.3675 7.5758 2.7585 6.2532 5.8292 3.5332 3.6433 1.0939 3.7620 3.4320 1.3930 2.6648 1.5632 2.7179 5.6193 3.1011 5.0859 6.4179 6.8657 4.8357 5.6587 3.8858 2.9110 3.4636 6.3912 1.3004 7.7991 1.8349 1.4997 2.4100 6.4289 1.4388 7.1105 1.3923 3.1566 5.1705 1.8439 1.4471 1.6110 2.5133 1.6165 2.3674 1.1945 1.3726 1.1183 3.0279 2.5765 1.2894 2.5855 2.6799 1.8727 1.3109 2.1788 5.4629 6.7638 3.7230 1.1938 1.0629 1.1134 1.0483 2.9200 4.3336 6.0899 7.4283 4.8420 1.2229 1.0380 1.0380 1.0973 1.0967 1.0985 1.0994 1.0899 1.0894 1.0931 1.0959 1.0948 1.0784 1.0453 1.1040
irintensity: 0.2606 1.3025 1.6403 1.0829 0.2187 0.7874 0.8370 0.4512 0.2321 2.7844 8.4596 0.2658 1.0195 9.2639 1.5995 1.7553 26.9199 10.8779 17.5345 4.8822 0.1833 27.2437 23.6600 177.5490 251.5366 100.4821 31.0045 2.3188 4.3989 15.3658 5.0187 0.7691 0.6545 112.8370 159.6294 3.1839 0.3205 56.6647 1.6478 84.9409 83.8862 32.1620 32.7192 11.6168 3.4805 61.9303 1.3319 3.2956 8.7608 1.5075 1.2051 16.5232 58.5615 0.3790 14.1804 11.7704 35.6768 39.2972 29.8851 25.9872 4.1686 66.9258 7.8081 5.9564 40.7231 123.0877 10.7670 121.5657 1.9648 33.6345 16.4906 50.4162 22.5959 73.3843 88.9565 513.8895 13.4511 175.9717 265.0745 17.7679 8.9886 15.5324 14.6384 8.6705 13.5699 13.2125 13.3695 7.4284 7.2670 5.7673 52.9564 113.9392 25.2627
temp: 298.150 k
press: 1.00000 atm
elementType: 16 8 8 7 7 7 7 6 6 6 6 6 6 6 6 6 6 6 6 1 1 1 1 1 1 1 1 1 1 1 1 1 1
symmnumber: 1
zpe: 649668.0 jmol-1
zpe.correction: 0.247445 hartree
zpe.thermalcorrener: 0.266152 hartree
zpe.thermalcorrenthalpy: 0.267097 hartree
zpe.thermalcorrgfe: 0.199210 hartree
zpe.sumelectzpe: -1231.648952 hartree
zpe.sumelectthermal: -1231.630245 hartree
zpe.sumelectthermalent: -1231.629301 hartree
zpe.sumelectthermalfe: -1231.697188 hartree
dipole: 2.8137 -4.6427 -4.3064
dipole: 6.9294
quadrupole: -89.0133 -120.1744 -120.1095
quadrupole: -26.9199 -3.4077 -9.9498
quadrupole: 20.7525 -10.4086 -10.3438 -26.9199 -3.4077 -9.9498
hfenergy: -1231.8963972 hartree
pointgroup: C01 [X(C12H14N4O2S1)]
dipole: -1.3301551 -2.3630766 -0.2810337 debye
polarizability: 248.2906123|-4.6991204|158.53854|27.2117233|33.5059914|195.7699573 unknown
InChI: InChI=1S/C12H14N4O2S/c1-8-7-12(15-9(2)14-8)16-19(17,18)11-5-3-10(13)4-6-11/h3-7,16H,13H2,1-2H3
charge 0 multiplicity 1
33 atoms
S  -0.765641 1.857201 0.706189
O  -1.611191 2.581357 1.897982
O  0.076528 2.725695 -0.367895
N  0.371945 0.826044 1.763321
N  1.415929 -0.239307 -0.056614
N  3.471812 -1.507877 0.233412
N  -4.511991 -1.903631 -2.181932
C  -1.883159 0.657793 -0.172334
C  1.430216 0.076157 1.275317
C  -3.097171 0.320297 0.453271
C  -1.511785 0.181576 -1.44233
C  2.465179 -0.382681 2.140464
C  -3.976785 -0.541061 -0.222677
C  -2.398534 -0.674355 -2.113946
C  -3.640787 -1.053331 -1.514502
C  3.475197 -1.187757 1.573669
C  2.442023 -1.014329 -0.521204
C  4.617817 -1.729198 2.403709
C  2.437254 -1.336864 -1.995176
H  0.372219 1.191891 2.722139
H  -3.348235 0.74189 1.431791
H  -0.550776 0.472151 -1.874894
H  2.480421 -0.123811 3.203497
H  -4.93072 -0.817232 0.240822
H  -2.135639 -1.058037 -3.106318
H  5.274939 -2.339671 1.76617
H  5.21295 -0.908654 2.845582
H  4.24652 -2.352302 3.238119
H  1.466175 -1.77205 -2.291155
H  2.574996 -0.413835 -2.588067
H  3.249637 -2.040535 -2.227755
H  -5.39958 -2.174047 -1.767655
H  -4.285461 -2.265387 -3.104101
