program: Gaussian 09
title: 000034629
version: EM64L-G09RevD.01
frameworkgroup: C1[X(C6H9NO2)]
method: RPBEPBE
basis: SDD
operation: Freq
keyword: #pfreq=noraman
keyword: PBEPBE/SDD
title: #p freq=noraman PBEPBE/SDD
converged: YES YES NO NO
title: Mulliken charges:
elementType: O O N C C C C C C H H H H H H H H H
charge: -0.222434 -0.220483 -0.358656 -0.126148 -0.422967 -0.490097 0.162641 -0.703774 0.153443 0.242202 0.224321 0.226667 0.259295 0.242105 0.210633 0.254124 0.219326 0.349802
chargesum: 0.00000
title: Mulliken charges with hydrogens summed into heavy atoms:
elementType: O O N C C C C C C
charge: -0.222434 -0.220483 -0.008854 0.116054 0.028020 0.011303 0.162641 -0.019691 0.153443
polarizability: 9.75539798e+01 -4.69648192e+00 7.50495444e+01 -1.00808028e+00 -1.79028479e+00 5.11471859e+01
1716.lowfreq: -11.7235 -6.8483 -0.0008 -0.0005 -0.0003 8.9199 63.5917 140.0732 186.8641
frequency: 63.5530 140.0730 186.8574 199.8783 274.4718 339.6155 356.0476 400.7807 464.8445 522.8931 564.3839 635.5476 689.2691 721.5920 812.5802 821.9809 873.1781 935.0146 945.9535 1036.1198 1064.3480 1102.3794 1126.7382 1181.9142 1196.5511 1247.7234 1276.7088 1299.8092 1319.8320 1321.9850 1350.5988 1373.5926 1394.1603 1445.7455 1467.7774 1475.5122 1482.4011 1633.5469 1643.0966 2947.9827 2987.9600 2993.5558 2998.6940 3060.3092 3080.7428 3087.5109 3109.0447 3479.6145
redmass: 3.8807 8.1401 1.0637 1.9730 2.8625 2.7846 5.7044 6.1459 3.7728 3.5590 3.4688 3.7293 4.3605 2.5963 1.3457 2.2125 2.3883 1.9290 1.3616 1.7448 2.0966 2.1826 1.6300 1.7548 1.9372 1.6694 1.3424 2.4141 1.3936 2.6940 1.6448 1.7989 1.2064 1.0827 1.0536 1.0688 1.0625 8.8257 6.2270 1.0809 1.0681 1.0379 1.0597 1.1011 1.0949 1.1001 1.0994 1.0758
irintensity: 0.2657 8.0704 0.0865 0.6103 2.6466 4.3637 17.6909 16.6145 2.4849 8.7501 1.5281 3.8065 5.7367 5.1836 117.4740 1.4863 2.8539 2.1509 5.2962 17.3337 5.9198 3.2165 1.4253 59.7316 151.9016 101.0188 4.6134 88.0858 11.6161 41.6334 21.3669 4.9974 30.1011 12.5689 8.5641 13.3927 13.5120 176.0547 384.3071 10.2940 6.4889 13.6879 47.1133 22.7465 9.7760 36.7905 14.0433 32.3488
temp: 298.150 k
press: 1.00000 atm
elementType: 8 8 7 6 6 6 6 6 6 1 1 1 1 1 1 1 1 1
symmnumber: 1
zpe: 383609.3 jmol-1
zpe.correction: 0.146109 hartree
zpe.thermalcorrener: 0.154597 hartree
zpe.thermalcorrenthalpy: 0.155541 hartree
zpe.thermalcorrgfe: 0.112751 hartree
zpe.sumelectzpe: -438.578500 hartree
zpe.sumelectthermal: -438.570013 hartree
zpe.sumelectthermalent: -438.569068 hartree
zpe.sumelectthermalfe: -438.611858 hartree
dipole: -1.5108 -3.3868 0.5198
dipole: 3.7447
quadrupole: -67.3564 -53.9357 -51.4175
quadrupole: 3.9983 0.2866 -0.6527
quadrupole: -9.7866 3.6342 6.1524 3.9983 0.2866 -0.6527
hfenergy: -438.7246093 hartree
pointgroup: C01 [X(C6H9N1O2)]
dipole: -0.5379552 -1.3589116 0.1858345 debye
dipolederiv: -0.9012976 0.1746258 0.0164803 0.4046469 -0.8428534 -0.0004456 -0.0118345 0.0484239 -0.3409494 -1.2189726 0.004293 0.0415872 -0.1950103 -0.5592438 0.0208436 0.0903187 0.0212202 -0.3581027 -1.6133722 0.3158889 0.0352275 0.3367932 -0.5380761 -0.0108934 0.0651561 0.0095817 -0.3235371 -0.023437 -0.0521164 -0.0059593 -0.0732221 -0.1785289 0.044364 0.0286279 0.0944191 0.1467537 -0.0116852 0.0081667 -0.0006077 0.0045098 0.0780379 -0.0159056 -0.0122853 -0.0063917 0.1421951 -0.0487534 -0.0609106 0.0137388 -0.0581913 -0.2445738 0.050486 0.0402092 0.0915184 0.1183578 1.7241945 -0.2349378 -0.0805248 -0.018508 0.9548686 -0.078875 -0.1232842 -0.1365744 0.2071624 -0.0231232 0.053994 -0.0173216 0.0172515 0.0351388 -0.0186604 0.009451 -0.0256355 0.0818684 1.7194065 -0.1686176 -0.0768948 -0.4039977 1.0567813 -0.0693597 -0.0912955 -0.1049673 0.2111879 0.052836 0.003012 -0.044698 -0.0125759 0.035163 0.0076696 -0.0290479 -0.0097491 -0.1200587 0.0348223 0.0135754 -0.0226841 0.0188564 0.0850181 0.0404467 -0.0181298 -0.0209973 -0.1439749 0.0458012 -0.0845896 0.0103724 -0.0690455 -0.1518184 0.0226866 0.0166275 0.0510699 0.0775511 -0.042446 0.0622454 0.0495445 0.0467143 0.0331837 -0.0361658 0.0545512 -0.0721815 0.0764937 0.0819346 -0.0414393 0.0042809 -0.0207509 0.0681302 0.0094052 -0.0454615 0.0267857 -0.0910047 0.043084 -0.0581863 -0.0033141 -0.1217255 -0.1186549 0.0605355 0.0080579 0.0661909 0.0722724 0.0089207 0.0638818 0.0357161 0.1339023 0.0336194 -0.0600474 0.0427029 -0.0526936 0.0663989 0.0623434 -0.0131748 0.0336181 -0.0039966 0.0967696 0.0187652 -0.0389608 -0.0016199 -0.1448803 0.1097441 0.0142895 0.0114386 0.0143494 0.1570387 0.0151503 0.014597 0.0216007 0.3222664 unknown
polarizability: 97.9003829|-3.7339476|74.7467711|-1.1040976|-1.4736495|51.103556 unknown
InChI: InChI=1S/C6H9NO2/c1-4-2-3-5(8)7-6(4)9/h4,7H,2-3H2,1H3
charge 0 multiplicity 1
18 atoms
O  -1.531652 1.857536 0.041078
O  2.876349 0.462047 -0.119321
N  0.639863 1.067208 -0.040757
C  -1.21174 -0.578477 0.332944
C  -0.216462 -1.58292 -0.298356
C  1.224123 -1.33717 0.194837
C  -0.75537 0.867898 0.097616
C  -2.661108 -0.779609 -0.153715
C  1.675223 0.104474 -0.003116
H  -1.189145 -0.721777 1.436296
H  -0.258623 -1.496046 -1.401505
H  -0.528889 -2.612276 -0.045316
H  1.956492 -1.983311 -0.317502
H  1.304133 -1.565223 1.277307
H  -3.029374 -1.777692 0.143104
H  -3.326578 -0.011515 0.272481
H  -2.720344 -0.700836 -1.254274
H  0.938603 2.042087 -0.173902
