program: Gaussian 09
title: 000005330
version: EM64L-G09RevD.01
frameworkgroup: C1[X(C11H12N4O3S)]
method: RPBEPBE
basis: SDD
operation: Freq
keyword: #p
keyword: freq=noraman
keyword: PBEPBE/SDD
title: #p freq=noraman PBEPBE/SDD
converged: YES YES NO NO
title: Mulliken charges:
elementType: S O O O N N N N C C C C C C C C C C C H H H H H H H H H H H H
charge: 0.958179 -0.554017 -0.489650 -0.275156 -0.614326 -0.134587 -0.688753 -0.125416 -0.094994 -0.231828 -0.138659 0.520000 -0.393709 -0.415792 0.277539 -0.259952 -0.259005 0.190641 -0.504533 0.328408 0.287506 0.306574 0.230158 0.231339 0.242692 0.265651 0.313694 0.314923 0.239269 0.229346 0.244458
chargesum: 0.00000
title: Mulliken charges with hydrogens summed into heavy atoms:
elementType: S O O O N N N N C C C C C C C C C C C
charge: 0.958179 -0.554017 -0.489650 -0.275156 -0.285918 -0.134587 -0.060136 -0.125416 -0.094994 0.055677 0.167916 0.520000 -0.163551 -0.184453 0.277539 -0.017260 0.006645 0.190641 0.208540
polarizability: 2.74026705e+02 -8.42452629e-01 2.12680402e+02 1.21970323e+01 1.46971210e+01 1.14417917e+02
1716.lowfreq: -8.6849 -4.6176 -0.0015 -0.0012 0.0017 3.8581 15.5286 38.9962 46.9653
frequency: 15.1989 38.9934 46.8753 58.0101 78.6409 113.3746 132.1697 136.4173 155.9347 169.9408 200.6205 206.7418 233.2928 246.1240 293.8677 322.8628 348.2030 391.8984 400.7117 408.7696 410.3305 412.1561 416.0080 427.9520 442.7538 477.3428 518.7518 522.4181 555.5516 598.0558 621.1849 623.6078 689.9778 718.3609 738.4759 764.9947 799.3466 811.1896 814.2620 822.0189 826.1521 834.1917 946.5504 947.7257 955.3216 957.3715 967.3346 977.1039 979.7057 1022.4153 1047.6842 1101.6481 1112.6135 1133.5070 1149.1568 1168.8768 1187.2015 1199.2761 1271.0063 1282.0927 1304.3497 1323.0100 1360.0198 1378.1603 1400.3931 1435.4374 1437.6976 1445.7548 1464.7666 1489.1669 1513.2774 1579.5803 1584.4128 1612.3831 1648.5673 2999.5992 3100.6310 3135.0808 3137.9687 3141.5740 3148.5450 3165.4393 3173.5034 3183.6333 3472.0872 3562.5632 3701.6046
redmass: 5.4621 3.9980 4.3572 7.3264 5.8249 4.9314 2.8857 2.5477 4.7486 2.0683 6.7685 6.1082 8.9213 6.5822 6.3184 5.5920 4.5930 4.1706 3.6567 1.4961 2.0496 3.6833 4.6363 1.4396 2.4400 3.4267 2.7477 3.6131 5.1682 5.9151 6.8273 6.5664 2.9608 2.9112 6.8670 5.8864 5.2854 1.4380 5.7422 2.0215 3.8405 1.8361 1.4129 12.8229 1.5591 4.4283 1.3531 3.9101 5.2023 1.4382 2.5066 1.5301 1.2535 1.1999 1.3214 4.7689 1.1210 1.5457 2.4509 3.6926 1.3164 2.4947 3.1558 2.8401 5.6803 3.5742 1.3612 1.0526 1.0530 2.8379 4.9287 6.6181 7.3319 4.8520 1.2204 1.0290 1.1043 1.0894 1.0899 1.1051 1.0908 1.0955 1.0956 1.0982 1.0774 1.0452 1.1040
irintensity: 1.5559 2.6511 1.2677 0.9150 0.9780 9.1217 4.5342 0.4858 3.1391 1.3029 1.2159 5.3264 14.0933 20.6375 13.3429 8.8326 11.9320 9.3186 16.1581 17.0001 32.9648 0.8457 32.6876 186.7373 223.3427 60.7629 42.8093 22.8433 3.5515 8.8149 21.3572 14.5725 265.2299 6.8593 0.7854 6.2961 41.7854 12.7706 60.5373 59.7177 27.9448 93.2849 3.5161 59.3923 19.2818 66.8222 0.7978 6.2441 8.3569 1.4029 58.7641 9.9527 0.1321 13.0781 3.9474 3.8101 62.7719 3.2407 127.5942 142.4176 11.0971 63.9165 11.9210 341.6323 5.7488 6.8654 56.0239 14.0240 38.9007 78.6327 73.8682 18.5190 8.5445 178.1298 265.4234 48.0563 27.2916 15.5950 11.5403 27.9139 5.8969 6.6392 21.8606 4.5165 37.5069 113.3942 24.7246
temp: 298.150 k
press: 1.00000 atm
elementType: 16 8 8 8 7 7 7 7 6 6 6 6 6 6 6 6 6 6 6 1 1 1 1 1 1 1 1 1 1 1 1
symmnumber: 1
zpe: 587064.6 jmol-1
zpe.correction: 0.223601 hartree
zpe.thermalcorrener: 0.242378 hartree
zpe.thermalcorrenthalpy: 0.243322 hartree
zpe.thermalcorrgfe: 0.175082 hartree
zpe.sumelectzpe: -1267.506276 hartree
zpe.sumelectthermal: -1267.487500 hartree
zpe.sumelectthermalent: -1267.486555 hartree
zpe.sumelectthermalfe: -1267.554795 hartree
dipole: -1.0816 5.1013 -3.9016
dipole: 6.5127
quadrupole: -84.9090 -104.9340 -124.0686
quadrupole: -21.8349 5.2355 11.0274
quadrupole: 19.7282 -0.2968 -19.4314 -21.8349 5.2355 11.0274
hfenergy: -1267.7298771 hartree
pointgroup: C01 [X(C11H12N4O3S1)]
dipole: 0.1674364 2.4767818 0.6347107 debye
polarizability: 273.159497|12.012729|190.7068196|3.3239358|-44.7780666|137.2587068 unknown
InChI: InChI=1S/C11H12N4O3S/c1-18-11-7-6-10(13-14-11)15-19(16,17)9-4-2-8(12)3-5-9/h2-7,15H,12H2,1H3
charge 0 multiplicity 1
31 atoms
S  1.261246 -1.72014 0.145333
O  2.278656 -2.677722 0.985453
O  0.531286 -2.26233 -1.195758
O  -4.927857 0.703934 0.128878
N  -0.032132 -1.377656 1.504014
N  -1.387641 -0.06136 0.105779
N  4.156605 3.469482 -0.946454
N  -2.603661 0.470337 -0.243783
C  2.106318 -0.093522 -0.165034
C  3.366885 0.096644 0.430456
C  1.49567 0.857427 -1.00306
C  3.476396 2.286924 -0.684187
C  4.053053 1.293439 0.165839
C  2.190224 2.049779 -1.262327
C  -1.309199 -0.924278 1.172279
C  -2.462639 -1.300557 1.938249
C  -3.690236 -0.74146 1.591241
C  -3.70962 0.150817 0.479958
C  -4.931727 1.609085 -1.042184
H  0.064749 -2.132321 2.198141
H  3.797199 -0.683121 1.066716
H  0.494758 0.67384 -1.404375
H  5.039268 1.463967 0.612455
H  1.73574 2.809344 -1.908457
H  -2.376966 -2.004074 2.772238
H  -4.614765 -0.973467 2.125096
H  5.0717 3.647499 -0.542379
H  3.754653 4.179149 -1.552413
H  -4.282147 2.481788 -0.858895
H  -5.984218 1.909317 -1.147884
H  -4.5721 1.07974 -1.940735
