program: Gaussian 09
title: 000005316
version: EM64L-G09RevD.01
frameworkgroup: C1[X(C8H11NO5S)]
method: RPBEPBE
basis: SDD
operation: Freq
keyword: #p
keyword: freq=noraman
keyword: PBEPBE/SDD
title: #p freq=noraman PBEPBE/SDD
converged: YES YES NO NO
title: Mulliken charges:
elementType: S O O O O O N C C C C C C C C H H H H H H H H H H H
charge: 0.898347 -0.537261 -0.542627 -0.164435 -0.409286 -0.198155 -0.137905 0.009879 -0.269841 -0.209398 -0.543713 0.167540 -0.704294 -0.700904 0.181372 0.341041 0.317238 0.275828 0.309436 0.231995 0.269916 0.261185 0.251881 0.240159 0.269135 0.392867
chargesum: 0.00000
title: Mulliken charges with hydrogens summed into heavy atoms:
elementType: S O O O O O N C C C C C C C C
charge: 0.898347 -0.537261 -0.542627 -0.164435 -0.016419 -0.198155 -0.137905 0.009879 0.071200 0.107840 0.041551 0.167540 0.058801 0.060271 0.181372
polarizability: 1.41659633e+02 7.83702635e+00 1.30247542e+02 -5.14923219e+00 6.78063282e+00 1.23007945e+02
1716.lowfreq: -17.5220 -13.7998 -6.6368 -0.0015 0.0008 0.0022 35.8533 55.7986 74.7739
frequency: 35.5699 55.7503 74.7261 105.3120 134.2221 150.0223 161.4521 170.5870 187.7788 204.1837 217.1495 224.5236 261.7985 271.6003 313.5988 351.9963 378.6290 383.2750 421.8181 431.3867 449.3578 494.2216 521.1065 582.9358 586.5689 615.3284 676.8161 729.5596 804.5888 816.9220 849.0195 895.0938 909.2073 930.6024 947.0834 951.7633 972.2427 990.5112 1002.1652 1024.5433 1062.2425 1075.7711 1098.9187 1152.4069 1183.0515 1189.8602 1210.4341 1213.6844 1255.7717 1267.9224 1285.3860 1353.5694 1392.7032 1405.5000 1415.1300 1445.9908 1455.6074 1463.1174 1474.3566 1665.1093 1747.8804 2981.9527 2986.4936 3029.3210 3055.6250 3076.7181 3080.4802 3096.3533 3100.2928 3119.7286 3140.8229 3510.8792
redmass: 5.6686 11.9114 9.9375 6.0877 6.0827 1.5220 2.4771 3.5602 2.2069 1.6615 3.2791 8.1896 4.1893 4.2336 3.2464 7.0707 3.8192 4.3346 6.2472 5.9864 3.3095 4.4277 3.5445 3.8181 2.0242 2.7037 2.7675 7.0500 17.0340 4.7974 4.4815 3.7340 3.6891 2.9647 1.6707 1.7546 2.6540 2.5245 1.7695 2.4981 1.9956 1.3777 1.8520 1.3336 1.8056 2.0641 2.0321 1.6301 1.9732 3.8747 1.7754 2.0037 1.1836 1.1745 1.1145 1.0463 1.0528 1.0508 1.0530 9.2076 12.7052 1.0378 1.0368 1.0620 1.0849 1.0974 1.0987 1.0998 1.0991 1.1033 1.0945 1.0642
irintensity: 1.5699 1.2670 5.3631 5.8053 0.9641 0.2097 2.8755 11.9575 10.7538 5.0337 4.9194 10.1975 0.8399 1.7319 4.2441 22.3017 0.2099 3.9165 8.4174 12.3955 2.2927 3.8261 3.7682 35.4177 76.4554 31.4426 78.4162 1.3925 74.9039 3.3872 32.0215 9.7279 54.4106 17.9846 7.6452 12.1516 1.7777 33.8467 25.5387 78.1927 207.2227 9.6605 131.0289 15.6272 1.0000 1.3089 27.1370 25.1687 4.3212 79.2380 24.1546 43.8273 32.3561 19.1471 26.0284 9.3873 3.4187 14.4927 19.7640 164.7705 430.5324 7.0504 12.0503 5.8295 1.3890 2.5058 3.6272 3.4723 12.9336 1.3617 0.9188 41.8739
temp: 298.150 k
press: 1.00000 atm
elementType: 16 8 8 8 8 8 7 6 6 6 6 6 6 6 6 1 1 1 1 1 1 1 1 1 1 1
symmnumber: 1
zpe: 492132.3 jmol-1
zpe.correction: 0.187443 hartree
zpe.thermalcorrener: 0.203416 hartree
zpe.thermalcorrenthalpy: 0.204360 hartree
zpe.thermalcorrgfe: 0.144333 hartree
zpe.sumelectzpe: -1139.070057 hartree
zpe.sumelectthermal: -1139.054085 hartree
zpe.sumelectthermalent: -1139.053140 hartree
zpe.sumelectthermalfe: -1139.113168 hartree
dipole: -4.0862 2.0599 0.8392
dipole: 4.6524
quadrupole: -87.5885 -112.9779 -97.7268
quadrupole: 3.8323 -9.0535 -11.5207
quadrupole: 11.8426 -13.5469 1.7043 3.8323 -9.0535 -11.5207
hfenergy: -1139.2575006 hartree
pointgroup: C01 [X(C8H11N1O5S1)]
dipole: 1.8196394 -0.1144819 -0.1615918 debye
dipolederiv: 1.0463266 0.0048313 -0.0228222 0.0109011 0.8639812 -0.1393972 -0.0293438 -0.0576354 0.9394826 -0.5015602 0.0042022 0.0628647 -0.0820844 -0.6261565 0.1388382 0.1733934 0.1619434 -0.7092229 -0.74885 -0.0305376 -0.0312164 0.0093367 -0.5394241 0.0278415 -0.167962 -0.0612519 -0.4753717 -0.3763241 -0.1048528 0.2329012 0.0356299 -0.545799 0.2513373 0.0956168 0.6874475 -1.0583498 -1.1146652 0.3177442 0.2248015 0.3186941 -0.5241422 -0.0816789 0.1547134 -0.0505751 -0.2897301 -0.6136082 0.0705052 -0.1277178 0.1541904 -0.3811785 -0.1226265 0.0059248 -0.2712638 -0.7367015 -0.611508 0.1135885 -0.2318342 0.0386611 -0.812052 0.3143769 -0.1392713 0.6053448 -0.6918469 0.1544889 -0.0825049 -0.0515981 -0.0637018 0.2684476 0.1671829 -0.1358116 0.1150776 0.1923397 0.2061838 0.5036451 -0.1415018 0.1950504 0.3159599 -0.0223378 -0.1213572 -0.2383947 0.1812841 0.1329743 -0.0724982 0.0130014 0.0258354 0.1726382 -0.128421 -0.0350305 0.0218327 -0.0781225 -0.2187674 0.0058948 0.1283265 0.1253974 0.0075546 0.0727889 0.1443433 -0.0485641 -0.1477207 0.5971919 -0.3965894 -0.0344104 -0.2675733 0.9030078 -0.65463 -0.0506573 -1.1213659 1.4910765 -0.1481185 0.0519226 0.0375065 -0.0164857 -0.0846534 -0.0673648 -0.0448695 -0.0085108 -0.1398646 -0.1076435 0.1135334 -0.0278759 0.0347916 -0.1198838 0.0709139 0.0455785 -0.040204 -0.1090149 1.4084121 -0.374038 0.0201021 -0.4818351 0.4270458 0.2398835 0.1199093 0.3741555 0.9252708 0.0779356 -0.0750212 -0.0260585 -0.0461275 -0.0879288 0.0321077 0.007658 0.0221108 0.0242199 0.0420037 0.0217289 0.0200345 -0.0195048 0.0989464 0.0412162 0.0356755 -0.0014176 0.0296964 0.1189733 0.0066966 0.0027541 0.0328715 -0.0537159 -0.0461975 0.0307164 -0.0213536 0.0890642 0.0708657 0.0016027 -0.0218878 -0.0832249 0.1580904 -0.0250585 -0.0102795 -0.0136162 0.097722 0.0105745 0.0791008 0.0795553 0.0735537 0.0580045 -0.0558086 0.0849697 -0.0760335 0.0084607 0.0289937 -0.1115556 -0.0381942 -0.0675048 0.0534665 0.0151492 0.0140811 0.0266906 0.0976805 0.0903336 0.0202575 -0.0269819 0.0229075 -0.0413644 0.0869867 -0.0100096 0.0497059 0.0653005 0.0253915 -0.1212408 -0.0340977 -0.0532483 -0.0109472 -0.0246002 -0.051327 -0.0143695 0.0897685 -0.0427923 0.0762114 0.0553334 0.0852122 0.0563161 -0.0018256 0.0504387 0.0066856 0.0946661 0.1247575 -0.0377869 -0.0031818 0.0056289 0.0863131 -0.0573843 -0.0542465 -0.0155755 -0.0338637 0.3484307 0.0151604 -0.0578023 0.0126287 0.3574738 -0.0312922 -0.1128532 -0.0308626 0.1437769 unknown
polarizability: 133.7415058|-10.8495396|133.3754923|-2.814111|-9.2523972|127.7981219 unknown
InChI: InChI=1S/C8H11NO5S/c1-8(2)6(7(11)12)9-4(10)3-5(9)15(8,13)14/h5-6,11H,3H2,1-2H3
charge 0 multiplicity 1
26 atoms
S  -1.580399 -0.763533 0.754052
O  -1.672702 -1.535051 2.192578
O  -2.858039 -0.759112 -0.277842
O  -0.160434 2.331704 -2.091815
O  3.245756 -0.832078 0.483635
O  1.951941 0.270748 2.074084
N  0.216238 1.093171 -0.018219
C  0.143846 -1.367603 -0.312136
C  -0.876617 1.123776 0.942108
C  1.06788 -0.09372 -0.212507
C  -1.637355 2.144846 0.064219
C  -0.461371 1.961819 -0.950556
C  -0.356928 -1.59643 -1.736133
C  0.608729 -2.616661 0.426224
C  2.097068 -0.172444 0.917815
H  -0.654579 1.232887 2.009998
H  1.602362 0.020238 -1.171726
H  -1.751698 3.155435 0.484056
H  -2.599838 1.76902 -0.326249
H  0.423007 -2.129696 -2.313473
H  -1.275559 -2.208071 -1.739358
H  -0.592556 -0.653641 -2.258661
H  -0.09665 -3.447268 0.255619
H  1.604971 -2.923247 0.05606
H  0.668586 -2.457329 1.517677
H  3.90234 -0.903361 1.22945
