program: Orca
programVersion: 5.0.2
elementType: O H H
charge: 0
multiplicity: 1
keywords: wB97X-D3BJ Opt Freq def2-TZVPP def2/J RIJCOSX VeryTightSCF
keywords: PAL8 defgrid3 VeryTightOpt
frequency: 0.00 0.00 0.00 0.00 0.00 0.00 1638.59 3863.77 3964.97
frequency: 1638.59 3863.77 3964.97
formula: H2O
InChI: InChI=1S/H2O/h1H2
3 atoms
O  -1.01193 3.328701 0.000246
H  -1.185423 3.887636 -0.759651
H  -1.184042 3.887141 0.760821
totalener: -76.47711764 hartree
nucrepener: 9.12381612 hartree
electener: -85.60093376 hartree
oneelecener: -122.95838523 hartree
twoeener: 37.35745147 hartree
kineticenergy: 76.19092951 hartree
exchangeener: -6.117623688291 hartree
correlationener: -0.418933139935 hartree
xcener: -6.536556828226 hartree
temp: 298.15 k
press: 1.00 atm
thermalcorrenthalpy: 0.00094421 hartree
totalenthalpy: -76.45265289 hartree
totalentropycorr: -0.02142518 hartree
gibbsenthalpy: -76.47407807 hartree
gibbsminuselec: 0.00360916 hartree
energy: -522.8004 -31.0929 -17.5667 -13.6776 -11.6292 2.6910 4.7024 12.4466 13.6153 13.8869 14.4620 17.2083 17.8602 20.4339 21.2470 23.8048 30.2211 34.5183 36.1616 49.3715 50.5973 51.5896 52.2088 53.9222 59.9627 67.6124 72.5313 76.8694 86.3197 89.0495 91.7998 92.1837 92.6297 94.7035 98.9005 100.4339 102.0045 102.1366 111.7867 114.3412 114.3506 116.0509 128.1698 128.9577 132.8624 137.7730 155.2153 169.6474 177.0329 177.5416 180.3983 181.3133 181.9804 187.2105 189.8062 203.6490 203.8584 210.4455 1186.8181 electronvolt
chargesum: -0.0000000
charge: -0.416328 0.208164 0.208164
charge: 0.268413 -0.134207 -0.134207
qa: -0.4163 0.2082 0.2082
va: 2.0440 1.0402 1.0402
dispcorr: -0.000569739 hartree
energy: -76.477782198431
dipole: -0.28767 0.06024 -0.22743 0.93006 -0.19477 0.73529 0.00056 -0.00012 0.00045
quadrupole: 0.17889 -5.66733 -0.95534 -0.29549 .00077 1.86993 -6.48735 -0.29549 0.95535 0.00058 4.12785 -7.35788 0.00 -0.00 1.00 -0.57837 0.28047 0 0 0 0.00340 -0.00144 9 3 0 -0.00021 0.00003 1 3 0
magnitude: 0.76966 au
magnitude: 1.95632 debye
zeropoint: 0.02156816 hartree
thermalvibcorrection: 0.00000275 hartree
thermalrotcorrection: 0.00141627 hartree
thermaltrasncorrection: 0.00141627 hartree
thermaltotal: -76.45337874 hartree
thermalcorr: 0.00283529 hartree
nonthermalcorr: 0.02156816 hartree
totalcorr: 0.02440345 hartree
totalenthalpy: -76.45243454 hartree
