program: Orca
programVersion: 5.0.2
elementType: C C C C C C H C H H C C H H N H H C O O H N C C H H H O H H
charge: 1
multiplicity: 1
keywords: DLPNO-CCSD(T) def2-TZVPP def2-TZVPP/C VeryTightSCF NormalPNO
keywords: PAL8
formula: C12H13N2O3
InChI: InChI=1S/C10H8NO2.C2H3N.H2O/c12-10(13)9-6-5-7-3-1-2-4-8(7)11-9;1-2-3;/h1-6,11-12H;1H3;1H2
30 atoms
C  4.551365 -1.417977 -0.207852
C  3.20227 -1.616375 -0.117398
C  2.359443 -0.489067 -0.021891
C  2.893857 0.820126 -0.020197
C  4.300654 0.980941 -0.115815
C  5.107671 -0.114233 -0.207195
H  2.770051 -2.60733 -0.11734
C  2.002994 1.906365 0.075513
H  4.713921 1.982336 -0.114924
H  6.181282 0.004908 -0.280297
C  0.646552 1.698826 0.164958
C  0.169747 0.390229 0.160677
H  2.40098 2.914972 0.077205
H  -0.059736 2.512347 0.237564
N  1.004112 -0.636051 0.071202
H  0.613568 -1.595578 0.071236
H  5.211511 -2.273529 -0.281758
C  -1.297428 0.028722 0.254173
O  -1.64996 -1.123607 0.26216
O  -2.061211 1.09304 0.319382
H  -3.017842 0.810403 0.36182
N  0.426835 -3.490604 0.028417
C  -0.000869 -4.554175 0.029404
C  -0.548899 -5.905816 0.031133
H  -1.077503 -6.083489 0.967487
H  -1.241579 -6.019143 -0.802586
H  0.25928 -6.629916 -0.070046
O  -4.516116 0.157273 0.339923
H  -5.306434 0.477326 0.780813
H  -4.49127 -0.796292 0.456658
totalener: -795.64629142 hartree
nucrepener: 1110.82907170 hartree
electener: -1906.47536311 hartree
oneelecener: -3274.59476134 hartree
twoeener: 1368.11939822 hartree
kineticenergy: 794.74262313 hartree
chargesum: 1.0000000
charge: 0.051542 -0.267160 0.259762 -0.014800 -0.072256 -0.114798 0.122448 0.007970 0.126641 0.133153 -0.124768 0.247682 0.140758 0.161657 -0.131474 0.291629 0.135325 0.493321 -0.467033 -0.411713 0.314194 -0.295584 0.006501 -0.027573 0.119881 0.120571 0.117619 -0.455045 0.261752 0.269799
charge: 0.051780 0.018467 -0.040648 -0.052492 0.040777 0.024791 0.027931 0.117235 0.033881 0.032494 0.021280 -0.031398 0.048879 0.040089 0.449401 -0.002473 0.036217 -0.375626 0.069817 0.335423 -0.136898 0.027101 -0.084617 0.046634 0.042833 0.043047 0.042519 0.376867 -0.102764 -0.100547
qa: 0.0515 -0.2672 0.2598 -0.0148 -0.0723 -0.1148 0.1224 0.0080 0.1266 0.1332 -0.1248 0.2477 0.1408 0.1617 -0.1315 0.2916 0.1353 0.4933 -0.4670 -0.4117 0.3142 -0.2956 0.0065 -0.0276 0.1199 0.1206 0.1176 -0.4550 0.2618 0.2698
va: 3.9307 4.0437 3.9029 3.8938 3.9796 4.0434 1.0360 3.8837 1.0082 1.0050 3.9437 3.8825 0.9996 1.0066 3.4744 0.9627 1.0004 4.1709 1.9846 2.0670 1.0176 2.9807 3.8020 3.8520 0.9994 0.9993 1.0008 2.0475 0.9911 0.9870
e0: -795.646291417 hartree
corrType: DLPNO BASED
energy: -798.800595372738
dipole: -2.84977 2.62168 -0.22809 -7.18924 6.46215 -0.72709 0.28867 0.04447 0.33314
magnitude: 0.83167 au
magnitude: 2.11393 debye
