program: Gaussian 09
title: 000034586
version: EM64L-G09RevD.01
frameworkgroup: C1[X(C12H6Cl2O2)]
method: RPBEPBE
basis: SDD
operation: Freq
keyword: #p
keyword: freq=noraman
keyword: PBEPBE/SDD
title: #p freq=noraman PBEPBE/SDD
converged: NO NO NO NO
title: Mulliken charges:
elementType: Cl Cl O O C C C C C C C C C C C C H H H H H H
charge: 0.002039 0.002028 -0.275398 -0.275384 0.262997 0.263019 0.240562 0.240584 -0.346782 -0.346772 -0.360616 -0.360615 -0.086748 -0.086715 -0.222814 -0.222812 0.287531 0.287530 0.261774 0.261774 0.237408 0.237408
chargesum: 0.00000
title: Mulliken charges with hydrogens summed into heavy atoms:
elementType: Cl Cl O O C C C C C C C C C C C C
charge: 0.002039 0.002028 -0.275398 -0.275384 0.262997 0.263019 0.240562 0.240584 -0.059251 -0.059242 -0.098841 -0.098841 -0.086748 -0.086715 0.014594 0.014597
polarizability: 2.75456718e+02 3.36020630e-04 1.50442073e+02 4.01072970e-03 -1.17797716e-02 5.58960477e+01
1716.lowfreq: -5.6956 -0.0014 0.0007 0.0012 1.5802 13.7694 32.9857 69.7099 144.4544
frequency: 32.9803 69.6456 144.4528 149.9257 163.8014 179.3092 256.2192 272.3792 277.2426 289.1159 366.2214 400.9857 443.1505 446.9157 474.9781 504.6830 526.3407 555.1751 564.4488 590.6449 649.7230 658.1348 686.4255 709.0556 715.4891 759.0652 827.8947 828.0557 842.3407 851.6880 868.5729 919.2420 933.4092 972.8555 1023.7098 1081.9344 1099.3796 1114.4961 1156.6258 1165.0661 1210.4015 1221.5496 1270.1898 1276.9358 1358.4327 1359.6005 1386.1548 1445.2640 1467.0542 1478.1011 1568.3410 1585.1451 1604.0679 1635.3773 3143.2364 3154.6764 3165.2697 3174.3997 3176.4404 3177.9485
redmass: 8.6289 8.1834 10.6961 8.5401 5.4464 29.8099 7.3657 5.5228 9.4175 12.2780 12.0724 9.2667 3.1128 3.1795 5.7575 10.6893 4.5159 9.6657 9.2675 11.5195 7.3368 4.0143 4.2665 6.9311 7.7497 1.2262 6.7956 5.9095 1.4127 1.3495 1.3806 10.3220 1.3648 1.2997 2.0242 2.9030 1.7025 8.3602 2.0068 1.0866 3.6048 1.2633 1.5281 4.6973 6.9504 8.6921 7.3306 2.4955 3.7245 3.2463 9.7879 7.3862 8.0720 8.1445 1.0858 1.0901 1.0950 1.0922 1.0932 1.1008
irintensity: 0.7510 0.0000 1.0908 0.1611 0.0000 0.0097 0.0000 0.1015 0.6861 2.2889 3.1985 2.4606 4.2447 9.0731 0.9459 5.4014 0.0000 5.5681 4.8818 0.0000 9.2118 0.0000 0.0000 3.0375 8.6730 111.7433 1.4610 118.9226 0.0000 0.0000 56.4965 29.1254 6.9668 0.0000 10.6440 10.5777 91.2554 32.8894 0.3779 6.1431 48.0388 0.3035 1.2145 388.3547 10.7086 81.4728 3.3410 10.0286 764.2182 49.9751 19.8130 2.8435 7.5078 0.0074 1.3277 10.7256 6.2394 2.0624 0.8258 12.5987
temp: 298.150 k
press: 1.00000 atm
elementType: 17 17 8 8 6 6 6 6 6 6 6 6 6 6 6 6 1 1 1 1 1 1
symmnumber: 1
zpe: 379397.8 jmol-1
zpe.correction: 0.144505 hartree
zpe.thermalcorrener: 0.157143 hartree
zpe.thermalcorrenthalpy: 0.158087 hartree
zpe.thermalcorrgfe: 0.104386 hartree
zpe.sumelectzpe: -1530.323012 hartree
zpe.sumelectthermal: -1530.310375 hartree
zpe.sumelectthermalent: -1530.309430 hartree
zpe.sumelectthermalfe: -1530.363131 hartree
dipole: 3.6309 0.0000 -0.0003
dipole: 3.6309
quadrupole: -98.2682 -98.8254 -109.0179
quadrupole: 0.0004 -0.0013 -0.0018
quadrupole: 3.7690 3.2118 -6.9807 0.0004 -0.0013 -0.0018
hfenergy: -1530.4675173 hartree
pointgroup: C01 [X(C12H6Cl2O2)]
dipole: 1.4285039 -0.0000246 0.000117 debye
dipolederiv: -0.6111027 0.284835 0.0000439 0.3706504 -0.2484026 -0.0000306 0.0000685 -0.0000356 -0.0230552 -0.6111103 -0.2848247 0.0000702 -0.3706443 -0.2483997 0.0000509 0.000174 0.000091 -0.0230652 -2.1037798 -0.0166627 0.0000092 -0.0580763 -0.3536977 0.0000578 0.0000122 0.0000759 -0.148368 -2.1039035 0.0167299 -0.0000112 0.0581927 -0.3537126 0.0000088 -0.0000405 -0.0000232 -0.148361 1.2871369 0.1959244 -0.0001059 0.9997415 0.1444588 -0.0000216 -0.0002381 -0.0000322 0.0757591 1.2872077 -0.1959892 0.000004 -0.9997996 0.1445138 -0.0000015 0.0001217 0.0000174 0.0757674 1.2443506 -0.1698435 0.0000563 -0.9385839 0.1047218 -0.0000273 0.0001716 -0.0000206 0.0699566 1.2444104 0.1698099 0.0000514 0.9385487 0.1047075 0.0000135 -0.0000207 0.0000236 0.0699587 -0.3870978 0.0511214 0.0000274 0.1081818 -0.0600763 -0.0000133 0.000044 -0.000029 -0.1061274 -0.3871415 -0.0510873 0.0000231 -0.1082024 -0.0600723 -0.0000021 0.0000352 0.0000161 -0.1061362 -0.2558988 0.0394822 0.0000086 -0.0211538 0.0672374 -0.0000516 0.0000128 -0.0000409 -0.1581342 -0.2558775 -0.0394643 0.0000121 0.021157 0.0672338 -0.0000348 -0.0000193 -0.0000427 -0.158132 0.6747556 -0.5440213 -0.0000769 -0.6375796 0.2994005 0.0000591 -0.0000714 0.0000973 -0.0675709 0.6747994 0.5439984 -0.0001146 0.6375746 0.299406 -0.0000998 -0.0002505 -0.0001908 -0.0675614 0.0215423 0.0250234 0.000014 0.0569907 0.0039865 -0.0000237 0.0000117 -0.000028 -0.1679285 0.0215298 -0.0250296 0.000029 -0.0569975 0.003977 -0.0000457 0.0000508 -0.0000421 -0.1679327 0.0970404 -0.0216204 0.0000136 -0.0145801 0.0318617 0.0000086 0.000013 0.0000057 0.181093 0.0970375 0.0216169 -0.000002 0.0145778 0.0318575 0.0000201 -0.0000094 0.0000324 0.181093 0.1068663 0.0282645 -0.0000113 0.006672 -0.0327944 0.0000415 0. 0.0000354 0.1766384 0.106866 -0.0282658 -0.0000032 -0.0066759 -0.0327939 0.0000402 -0.0000132 0.0000367 0.176639 -0.0738189 -0.0817042 -0.0000016 -0.090004 0.0432975 0.0000178 -0.0000099 0.0000177 0.1677335 -0.0738122 0.081707 -0.0000363 0.0900103 0.04329 0.0000336 -0.0000424 0.0000358 0.167734 unknown
polarizability: 275.4567178|-0.0017843|150.442073|-0.0040109|-0.0117797|55.8960477 unknown
InChI: InChI=1S/C12H6Cl2O2/c13-7-5-11-12(6-8(7)14)16-10-4-2-1-3-9(10)15-11/h1-6H
charge 0 multiplicity 1
22 atoms
Cl -4.53539 1.64765 0.000216
Cl -4.535415 -1.647552 0.000341
O  0.635136 1.45958 -0.000441
O  0.635092 -1.459566 -0.000006
C  -0.562211 0.710363 -0.000226
C  -0.562212 -0.710356 -0.000039
C  1.841939 0.709635 -0.000233
C  1.841922 -0.709672 0.000032
C  -1.774111 1.413942 -0.000177
C  -1.774142 -1.413888 0.000062
C  3.052834 1.418736 -0.000274
C  3.052793 -1.418805 0.000286
C  -2.996657 0.706964 -0.000002
C  -2.996661 -0.706872 0.000018
C  4.276074 0.707532 -0.000037
C  4.276051 -0.707636 0.000258
H  -1.759282 2.507175 -0.00023
H  -1.759347 -2.507122 0.000233
H  3.02356 2.512865 -0.000483
H  3.023496 -2.512934 0.000496
H  5.221089 1.25996 -0.000063
H  5.221043 -1.260098 0.000466
