program: Orca
programVersion: 5.0.2
elementType: C C C C C C H C H H C C H H N H H C O O H O H H O H H
charge: 1
multiplicity: 1
keywords: wB97X-D3BJ Opt Freq def2-TZVPP def2/J RIJCOSX VeryTightSCF
keywords: PAL8 defgrid3 VeryTightOpt
frequency: 0.00 0.00 0.00 0.00 0.00 0.00 15.87 17.13 45.44 59.10 68.86 85.04 107.71 120.46 139.58 183.67 203.60 249.66 256.59 276.31 299.19 359.38 392.50 410.33 485.15 507.32 520.64 529.35 549.24 608.18 633.27 643.87 750.42 762.30 786.84 795.98 803.81 822.67 884.89 905.77 917.78 923.77 993.99 1024.91 1054.06 1055.94 1061.07 1071.82 1161.30 1171.81 1189.34 1201.00 1259.48 1305.14 1325.01 1389.27 1398.67 1425.57 1438.03 1511.13 1535.65 1567.04 1613.37 1643.26 1650.55 1672.96 1690.43 1720.38 1824.38 2660.94 3214.31 3216.99 3219.71 3229.23 3239.39 3264.33 3490.31 3578.87 3866.97 3915.29 3961.24
frequency: 15.87 17.13 45.44 59.10 68.86 85.04 107.71 120.46 139.58 183.67 203.60 249.66 256.59 276.31 299.19 359.38 392.50 410.33 485.15 507.32 520.64 529.35 549.24 608.18 633.27 643.87 750.42 762.30 786.84 795.98 803.81 822.67 884.89 905.77 917.78 923.77 993.99 1024.91 1054.06 1055.94 1061.07 1071.82 1161.30 1171.81 1189.34 1201.00 1259.48 1305.14 1325.01 1389.27 1398.67 1425.57 1438.03 1511.13 1535.65 1567.04 1613.37 1643.26 1650.55 1672.96 1690.43 1720.38 1824.38 2660.94 3214.31 3216.99 3219.71 3229.23 3239.39 3264.33 3490.31 3578.87 3866.97 3915.29 3961.24
formula: C10H12NO4
InChI: InChI=1S/C10H8NO2.2H2O/c12-10(13)9-6-5-7-3-1-2-4-8(7)11-9;;/h1-6,11-12H;2*1H2
27 atoms
C  -3.706572 -1.370594 -0.112919
C  -2.361314 -1.614379 -0.08679
C  -1.481392 -0.517495 -0.024003
C  -1.963161 0.810979 0.011846
C  -3.366545 1.019304 -0.017104
C  -4.214299 -0.04795 -0.078033
H  -1.970229 -2.624539 -0.113044
C  -1.027277 1.863935 0.075611
H  -3.74627 2.033482 0.01023
H  -5.285272 0.108496 -0.099993
C  0.32683 1.613061 0.102668
C  0.75163 0.290225 0.065162
H  -1.390538 2.885246 0.104143
H  1.06488 2.400268 0.153012
N  -0.129306 -0.698293 0.00508
H  0.281744 -1.63218 -0.016923
H  -4.398798 -2.202195 -0.160955
C  2.190797 -0.190862 0.090047
O  2.402861 -1.381866 0.051594
O  3.046932 0.781425 0.154274
H  4.004342 0.410927 0.197716
O  5.362776 -0.216544 0.34119
H  5.380347 -1.16607 0.203173
H  6.196553 0.151326 -0.008339
O  7.741381 0.807684 -0.549593
H  8.457224 1.040663 0.045556
H  8.062279 0.975126 -1.437991
totalener: -744.26978406 hartree
nucrepener: 925.11711790 hartree
electener: -1669.38690195 hartree
oneelecener: -2833.36143722 hartree
twoeener: 1163.97453527 hartree
kineticenergy: 741.28466204 hartree
exchangeener: -65.111681694730 hartree
correlationener: -4.663262754370 hartree
xcener: -69.774944449100 hartree
temp: 298.15 k
press: 1.00 atm
thermalcorrenthalpy: 0.00094421 hartree
totalenthalpy: -744.09154774 hartree
totalentropycorr: -0.06058320 hartree
gibbsenthalpy: -744.15213094 hartree
gibbsminuselec: 0.17078274 hartree
chargesum: 1.0000000
charge: -0.056989 -0.162662 0.140386 -0.003004 -0.094575 -0.109037 0.144078 -0.000121 0.152116 0.163207 -0.119670 0.124605 0.161835 0.176643 -0.021570 0.210755 0.164856 0.350541 -0.348632 -0.296409 0.270583 -0.417405 0.240719 0.262340 -0.422436 0.247222 0.242626
charge: 0.051475 0.020060 -0.063270 -0.047493 0.046076 0.033188 0.033035 0.106187 0.037350 0.036864 0.034836 -0.051499 0.049415 0.044563 0.465506 0.035633 0.039709 -0.462749 0.111792 0.371185 -0.173561 0.427477 -0.110171 -0.163348 0.350229 -0.109981 -0.112508
qa: -0.0570 -0.1627 0.1404 -0.0030 -0.0946 -0.1090 0.1441 -0.0001 0.1521 0.1632 -0.1197 0.1246 0.1618 0.1766 -0.0216 0.2108 0.1649 0.3505 -0.3486 -0.2964 0.2706 -0.4174 0.2407 0.2623 -0.4224 0.2472 0.2426
va: 4.0336 4.0317 3.9027 3.8782 3.9732 4.0330 1.0088 3.9068 1.0014 0.9935 3.9715 3.8527 0.9948 1.0056 3.5655 1.0215 0.9916 4.3354 2.1473 2.1959 1.0794 2.1052 1.0131 1.0529 2.0840 1.0078 1.0103
dispcorr: -0.053149212 hartree
energy: -744.322990961770
dipole: 8.71232 -8.64832 0.06400 1.43409 -0.97154 0.46255 -1.01176 0.52093 -0.49083
magnitude: 0.67747 au
magnitude: 1.72199 debye
zeropoint: 0.21399920 hartree
thermalvibcorrection: 0.01360645 hartree
thermalrotcorrection: 0.00141627 hartree
thermaltrasncorrection: 0.00141627 hartree
thermaltotal: -744.09255276 hartree
thermalcorr: 0.01643900 hartree
nonthermalcorr: 0.21399920 hartree
totalcorr: 0.23043820 hartree
totalenthalpy: -744.09160855 hartree
