program: Orca
programVersion: 5.0.2
elementType: C C C C C C H C H H C C H H N H H C O O H N C C H H H O H H
charge: 1
multiplicity: 1
keywords: wB97X-D3BJ Opt Freq def2-TZVPP def2/J RIJCOSX VeryTightSCF
keywords: PAL8 defgrid3 VeryTightOpt
frequency: 0.00 0.00 0.00 0.00 0.00 0.00 2.21 20.65 24.20 49.04 52.85 80.85 93.05 102.81 113.77 132.83 164.75 184.87 189.32 213.90 255.84 342.86 353.67 377.63 399.78 407.77 409.48 430.01 490.59 507.64 530.55 543.99 604.13 637.54 644.72 758.73 766.92 798.77 810.17 828.75 892.95 906.12 923.23 946.46 990.30 994.76 1023.35 1046.26 1053.25 1056.61 1060.91 1066.81 1066.97 1163.67 1176.90 1190.62 1212.83 1256.76 1297.84 1328.78 1344.63 1406.80 1420.05 1433.86 1457.63 1475.04 1475.07 1477.67 1521.83 1546.36 1608.99 1640.76 1674.40 1699.52 1733.04 1834.52 2437.83 3090.27 3100.00 3160.08 3177.31 3177.44 3215.72 3217.30 3223.01 3235.20 3241.84 3267.95 3824.68 3934.55
frequency: 2.21 20.65 24.20 49.04 52.85 80.85 93.05 102.81 113.77 132.83 164.75 184.87 189.32 213.90 255.84 342.86 353.67 377.63 399.78 407.77 409.48 430.01 490.59 507.64 530.55 543.99 604.13 637.54 644.72 758.73 766.92 798.77 810.17 828.75 892.95 906.12 923.23 946.46 990.30 994.76 1023.35 1046.26 1053.25 1056.61 1060.91 1066.81 1066.97 1163.67 1176.90 1190.62 1212.83 1256.76 1297.84 1328.78 1344.63 1406.80 1420.05 1433.86 1457.63 1475.04 1475.07 1477.67 1521.83 1546.36 1608.99 1640.76 1674.40 1699.52 1733.04 1834.52 2437.83 3090.27 3100.00 3160.08 3177.31 3177.44 3215.72 3217.30 3223.01 3235.20 3241.84 3267.95 3824.68 3934.55
formula: C12H13N2O3
InChI: InChI=1S/C10H8NO2.C2H3N.H2O/c12-10(13)9-6-5-7-3-1-2-4-8(7)11-9;1-2-3;/h1-6,11-12H;1H3;1H2
30 atoms
C  4.563977 -1.340368 0.039026
C  3.221824 -1.595595 0.01914
C  2.328361 -0.504513 0.000775
C  2.800988 0.827093 0.009464
C  4.202841 1.04841 0.02796
C  5.060257 -0.012014 0.040684
H  2.832771 -2.605505 0.030148
C  1.853817 1.869599 0.002484
H  4.572505 2.066685 0.033486
H  6.130065 0.153599 0.055803
C  0.505259 1.59766 -0.008008
C  0.090972 0.267514 -0.018698
H  2.201346 2.896674 0.008801
H  -0.241535 2.377597 -0.008258
N  0.980312 -0.715538 -0.019988
H  0.645189 -1.697356 -0.051991
H  5.264597 -2.166152 0.057118
C  -1.363413 -0.164019 -0.015605
O  -1.661924 -1.332174 0.03699
O  -2.171142 0.860422 -0.068902
H  -3.132443 0.577629 -0.054779
N  -4.795064 0.253852 -0.02572
C  -5.917743 0.031266 0.00589
C  -7.347554 -0.251166 0.0464
H  -7.506898 -1.32911 0.028666
H  -7.774767 0.16328 0.959341
H  -7.832826 0.201276 -0.818199
O  0.252436 -3.412156 -0.027575
H  -0.700858 -3.289046 0.042213
H  0.391007 -4.166686 -0.60413
totalener: -800.65103305 hartree
nucrepener: 1092.13723413 hartree
electener: -1892.78826718 hartree
oneelecener: -3238.79928919 hartree
twoeener: 1346.01102201 hartree
kineticenergy: 797.37310852 hartree
exchangeener: -71.106893957272 hartree
correlationener: -5.135717107318 hartree
xcener: -76.242611064589 hartree
temp: 298.15 k
press: 1.00 atm
thermalcorrenthalpy: 0.00094421 hartree
totalenthalpy: -800.45484290 hartree
totalentropycorr: -0.06539762 hartree
gibbsenthalpy: -800.52024052 hartree
gibbsminuselec: 0.19079516 hartree
chargesum: 1.0000000
charge: -0.042142 -0.193099 0.159287 -0.012223 -0.090019 -0.116798 0.144609 -0.019805 0.149197 0.160245 -0.119042 0.109013 0.159312 0.173810 -0.029704 0.222720 0.161279 0.369868 -0.358169 -0.278508 0.255677 -0.091304 -0.114035 -0.097716 0.137193 0.139249 0.139193 -0.403947 0.247514 0.238346
charge: 0.045042 0.022463 -0.060317 -0.048295 0.041640 0.030540 0.031554 0.099162 0.035824 0.035409 0.031629 -0.060234 0.047787 0.041877 0.466803 -0.020830 0.037463 -0.445719 0.118975 0.391647 -0.163341 0.124740 -0.090748 0.037761 0.046761 0.047411 0.047377 0.342181 -0.118141 -0.116422
qa: -0.0421 -0.1931 0.1593 -0.0122 -0.0900 -0.1168 0.1446 -0.0198 0.1492 0.1602 -0.1190 0.1090 0.1593 0.1738 -0.0297 0.2227 0.1613 0.3699 -0.3582 -0.2785 0.2557 -0.0913 -0.1140 -0.0977 0.1372 0.1392 0.1392 -0.4039 0.2475 0.2383
va: 3.9988 4.0164 3.9012 3.8940 3.9673 4.0386 1.0322 3.9203 1.0017 0.9941 3.9673 3.8759 0.9954 1.0071 3.4827 1.0768 0.9925 4.2816 2.1229 2.2182 1.0871 3.1498 3.8606 3.8482 0.9957 0.9955 0.9955 2.0973 1.0138 1.0124
dispcorr: -0.060033806 hartree
energy: -800.711074626222
dipole: -5.12751 4.66512 -0.46239 -3.61021 3.48033 -0.12988 -0.29669 -0.01593 -0.31262
magnitude: 0.57306 au
magnitude: 1.45661 debye
zeropoint: 0.23700542 hartree
thermalvibcorrection: 0.01542811 hartree
thermalrotcorrection: 0.00141627 hartree
thermaltrasncorrection: 0.00141627 hartree
thermaltotal: -800.45580855 hartree
thermalcorr: 0.01826065 hartree
nonthermalcorr: 0.23700542 hartree
totalcorr: 0.25526607 hartree
totalenthalpy: -800.45486435 hartree
