program: Orca
programVersion: 5.0.2
elementType: C C C C C C H C H H C C H H N H H O H N C C H H H
charge: 1
multiplicity: 1
keywords: DLPNO-CCSD(T) def2-TZVPP def2-TZVPP/C VeryTightSCF NormalPNO
keywords: PAL8
formula: C11H11N2O
InChI: InChI=1S/C9H8NO.C2H3N/c11-9-6-5-7-3-1-2-4-8(7)10-9;1-2-3/h1-6,10-11H;1H3
25 atoms
C  4.291712 -0.593549 0.000136
C  3.107554 -1.293088 0.000058
C  1.906028 -0.5774 -0.000022
C  1.893781 0.825012 -0.000026
C  3.125208 1.512345 0.000054
C  4.304831 0.813126 0.000134
H  3.100314 -2.376967 0.00006
C  0.630829 1.485782 -0.000107
H  3.122102 2.595952 0.000052
H  5.250508 1.33961 0.000198
C  -0.540089 0.794297 -0.000172
C  -0.494464 -0.622633 -0.000162
H  0.613333 2.570077 -0.000115
H  -1.504906 1.281031 -0.000234
N  0.687835 -1.237552 -0.000095
H  0.675138 -2.249615 -0.00009
H  5.229088 -1.1361 0.000201
O  -1.528738 -1.408443 -0.000216
H  -2.399023 -0.915333 -0.000202
N  -3.900052 -0.169792 -0.000085
C  -5.003976 0.13603 0.000038
C  -6.409524 0.520558 0.000196
H  -7.02871 -0.37653 0.004695
H  -6.624856 1.114377 0.888397
H  -6.627065 1.106976 -0.892375
totalener: -606.78911414 hartree
nucrepener: 774.46803814 hartree
electener: -1381.25715228 hartree
oneelecener: -2345.60356771 hartree
twoeener: 964.34641542 hartree
kineticenergy: 606.09260265 hartree
chargesum: 1.0000000
charge: 0.010449 -0.220880 0.252706 -0.051884 -0.042614 -0.123530 0.108143 -0.002887 0.125347 0.131153 -0.185619 0.550263 0.134827 0.127299 -0.179544 0.226428 0.133709 -0.404462 0.326737 -0.304865 0.038689 -0.021911 0.126179 0.123116 0.123150
charge: 0.052700 0.003907 -0.059994 -0.074844 0.047599 0.012440 0.026215 0.115616 0.034150 0.030574 -0.011606 -0.160407 0.050003 0.029805 0.405835 0.031803 0.036771 0.370834 -0.157266 0.080347 -0.055981 0.053623 0.046985 0.045441 0.045450
qa: 0.0104 -0.2209 0.2527 -0.0519 -0.0426 -0.1235 0.1081 -0.0029 0.1253 0.1312 -0.1856 0.5503 0.1348 0.1273 -0.1795 0.2264 0.1337 -0.4045 0.3267 -0.3049 0.0387 -0.0219 0.1262 0.1231 0.1232
va: 4.0240 4.0548 3.8481 3.8735 3.9730 4.0505 1.0225 3.9331 1.0063 1.0054 3.8771 4.0046 1.0013 1.0144 3.3318 0.9866 1.0022 2.0932 1.0076 3.0178 3.7698 3.8455 0.9993 0.9997 0.9997
e0: -606.789114140 hartree
corrType: DLPNO BASED
energy: -609.270031282626
dipole: -6.18974 4.62736 -1.56238 2.92082 -2.44045 0.48037 0.00076 -0.00060 0.00016
magnitude: 1.63456 au
magnitude: 4.15471 debye
