program: Orca
programVersion: 5.0.2
elementType: C C C C C C H C H H C C H H N H H O H H N C C H H H O H
charge: 1
multiplicity: 1
keywords: wB97X-D3BJ Opt Freq def2-TZVPP def2/J RIJCOSX VeryTightSCF
keywords: PAL8 defgrid3 VeryTightOpt
frequency: 0.00 0.00 0.00 0.00 0.00 0.00 -8.93 -1.80 22.35 38.19 44.01 62.06 69.52 88.75 129.67 135.48 174.23 183.17 270.56 296.86 305.53 328.25 397.56 401.70 402.93 413.07 454.90 489.98 493.79 539.91 553.91 641.69 702.89 743.17 793.92 807.08 810.33 849.38 918.50 936.36 939.91 1000.09 1010.84 1020.86 1044.73 1058.63 1065.74 1066.89 1067.06 1165.45 1177.74 1193.49 1226.81 1249.59 1302.14 1323.89 1383.12 1407.71 1421.47 1454.56 1465.20 1478.36 1478.40 1545.66 1568.31 1626.34 1651.03 1693.67 1700.34 1750.80 2409.40 3089.84 3174.84 3174.93 3212.29 3215.52 3218.54 3229.99 3237.82 3238.91 3278.97 3852.74 3861.68 3943.48
frequency: 22.35 38.19 44.01 62.06 69.52 88.75 129.67 135.48 174.23 183.17 270.56 296.86 305.53 328.25 397.56 401.70 402.93 413.07 454.90 489.98 493.79 539.91 553.91 641.69 702.89 743.17 793.92 807.08 810.33 849.38 918.50 936.36 939.91 1000.09 1010.84 1020.86 1044.73 1058.63 1065.74 1066.89 1067.06 1165.45 1177.74 1193.49 1226.81 1249.59 1302.14 1323.89 1383.12 1407.71 1421.47 1454.56 1465.20 1478.36 1478.40 1545.66 1568.31 1626.34 1651.03 1693.67 1700.34 1750.80 2409.40 3089.84 3174.84 3174.93 3212.29 3215.52 3218.54 3229.99 3237.82 3238.91 3278.97 3852.74 3861.68 3943.48
formula: C11H13N2O2
InChI: InChI=1S/C9H8NO.C2H3N.H2O/c11-9-6-5-7-3-1-2-4-8(7)10-9;1-2-3;/h1-6,10-11H;1H3;1H2
28 atoms
C  3.249242 -0.980796 -0.463795
C  1.975838 -1.487278 -0.368905
C  0.911466 -0.595827 -0.176786
C  1.130638 0.787225 -0.081876
C  2.451593 1.274374 -0.185613
C  3.492519 0.403805 -0.373208
H  1.782712 -2.550778 -0.436487
C  0.003164 1.631945 0.113183
H  2.625132 2.341735 -0.115346
H  4.506027 0.775467 -0.453639
C  -1.253454 1.121857 0.216011
C  -1.420398 -0.276373 0.12741
H  0.158125 2.702777 0.183074
H  -2.119362 1.750604 0.375012
N  -0.383718 -1.066457 -0.078672
H  -0.545262 -2.082812 -0.116927
H  4.081259 -1.65842 -0.611715
O  -0.5752 -3.874638 -0.210394
H  -0.784595 -4.406497 0.561693
H  -0.900538 -4.36913 -0.967064
N  -0.987896 -0.568899 3.03546
C  -0.882768 -0.592735 4.178648
C  -0.749356 -0.622491 5.632827
H  -1.519422 0.001748 6.085633
H  -0.86076 -1.645333 5.992057
H  0.232233 -0.246125 5.920116
O  -2.583435 -0.897521 0.211937
H  -3.288634 -0.286183 0.447643
totalener: -687.21015255 hartree
nucrepener: 949.91969726 hartree
electener: -1637.12984981 hartree
oneelecener: -2802.56804063 hartree
twoeener: 1165.43819082 hartree
kineticenergy: 684.19058546 hartree
exchangeener: -61.736942687518 hartree
correlationener: -4.512350267652 hartree
xcener: -66.249292955170 hartree
temp: 298.15 k
press: 1.00 atm
thermalcorrenthalpy: 0.00094421 hartree
totalenthalpy: -687.02664703 hartree
totalentropycorr: -0.05466400 hartree
gibbsenthalpy: -687.08131103 hartree
gibbsminuselec: 0.18523444 hartree
chargesum: 1.0000000
charge: -0.057288 -0.177057 0.150013 -0.043103 -0.088511 -0.128729 0.129931 -0.054883 0.144008 0.154652 -0.114918 0.360024 0.152081 0.122994 -0.046841 0.220374 0.155405 -0.413543 0.249636 0.249433 -0.084704 -0.190166 -0.102707 0.134188 0.132871 0.133367 -0.231860 0.245336
charge: 0.035799 0.014127 -0.071204 -0.064357 0.038604 0.015979 0.026446 0.092066 0.033555 0.031715 -0.001813 -0.219673 0.046793 0.031573 0.441853 -0.026733 0.034557 0.352218 -0.108089 -0.108237 0.031110 -0.141147 0.027448 0.044007 0.043633 0.043615 0.427685 -0.071529
qa: -0.0573 -0.1771 0.1500 -0.0431 -0.0885 -0.1287 0.1299 -0.0549 0.1440 0.1547 -0.1149 0.3600 0.1521 0.1230 -0.0468 0.2204 0.1554 -0.4135 0.2496 0.2494 -0.0847 -0.1902 -0.1027 0.1342 0.1329 0.1334 -0.2319 0.2453
va: 4.0173 3.9961 3.9052 3.9078 3.9646 4.0436 1.0501 3.9982 1.0017 0.9956 3.9413 4.1065 0.9960 1.0076 3.3487 1.0656 0.9942 2.1103 1.0071 1.0068 3.1308 3.9700 3.8416 0.9965 0.9966 0.9964 2.2999 1.0108
dispcorr: -0.054542711 hartree
energy: -687.288507346426
dipole: 0.68102 -1.65554 -0.97451 -3.13050 2.66152 -0.46898 6.18185 -5.50080 0.68104
magnitude: 1.27806 au
magnitude: 3.24857 debye
zeropoint: 0.22594297 hartree
thermalvibcorrection: 0.01271678 hartree
thermalrotcorrection: 0.00141627 hartree
thermaltrasncorrection: 0.00141627 hartree
thermaltotal: -687.04701506 hartree
thermalcorr: 0.01554932 hartree
nonthermalcorr: 0.22594297 hartree
totalcorr: 0.24149229 hartree
totalenthalpy: -687.04607085 hartree
