program: Orca
programVersion: 5.0.2
elementType: C C C C C C H C H H C C H H N H C H H H Cl O H H
charge: 1
multiplicity: 1
keywords: DLPNO-CCSD(T) def2-TZVPP def2-TZVPP/C VeryTightSCF NormalPNO
keywords: PAL8
formula: C10H11ClNO
InChI: InChI=1S/C10H9ClN.H2O/c1-7-5-6-8-3-2-4-9(11)10(8)12-7;/h2-6,12H,1H3;1H2
24 atoms
C  2.068936 -2.324986 0.037774
C  0.954565 -1.531156 0.003136
C  1.102265 -0.129017 0.002394
C  2.381615 0.451755 0.036323
C  3.517126 -0.391969 0.071469
C  3.357446 -1.749673 0.072133
H  1.952497 -3.401303 0.038482
C  2.457381 1.865925 0.03369
H  4.503655 0.054124 0.097714
H  4.220806 -2.40193 0.0991
C  1.328303 2.642148 -0.000336
C  0.067455 2.028217 -0.033438
H  3.435389 2.333861 0.059568
H  1.370466 3.724077 -0.001913
N  0.009216 0.69762 -0.030949
H  -0.897929 0.243294 -0.054734
C  -1.217787 2.78745 -0.071794
H  -1.020998 3.857282 -0.063968
H  -1.778898 2.532992 -0.974294
H  -1.834074 2.529933 0.792994
Cl -0.630182 -2.20566 -0.039738
O  0.439225 5.793719 -0.011724
H  0.482683 6.382106 -0.769832
H  0.444554 6.375844 0.752389
totalener: -973.92970838 hartree
nucrepener: 841.88853052 hartree
electener: -1815.81823891 hartree
oneelecener: -2990.35611869 hartree
twoeener: 1174.53787978 hartree
kineticenergy: 973.43009351 hartree
chargesum: 1.0000000
charge: 0.008155 -0.132554 0.319004 -0.056994 -0.059614 -0.103637 0.136233 0.030869 0.131815 0.137802 -0.134132 0.268226 0.141040 0.157994 -0.173770 0.215032 -0.211375 0.122234 0.112873 0.112499 -0.048695 -0.497680 0.262312 0.262361
charge: 0.031519 -0.379736 -0.078191 -0.061172 0.048288 0.024366 0.040012 0.124418 0.036029 0.035035 0.013051 -0.011743 0.050504 0.030896 0.418101 0.013586 0.068501 0.032661 0.033570 0.033400 0.450733 0.274740 -0.114284 -0.114283
qa: 0.0082 -0.1326 0.3190 -0.0570 -0.0596 -0.1036 0.1362 0.0309 0.1318 0.1378 -0.1341 0.2682 0.1410 0.1580 -0.1738 0.2150 -0.2114 0.1222 0.1129 0.1125 -0.0487 -0.4977 0.2623 0.2624
va: 3.9470 4.0439 3.6668 3.8847 3.9923 4.0053 1.0009 3.8976 1.0052 1.0032 3.8120 3.7929 0.9994 1.0336 3.4433 1.0093 3.9052 1.0230 1.0011 1.0012 1.1890 1.9826 0.9903 0.9903
e0: -973.929708383 hartree
corrType: DLPNO BASED
energy: -976.291593984564
dipole: 2.44860 -2.18260 0.26600 19.76505 -17.64884 2.11621 0.04084 -0.03573 0.00511
magnitude: 2.13287 au
magnitude: 5.42132 debye
