program: Orca
programVersion: 5.0.2
elementType: C C C C C C H C H H C C H H N H C H H H Cl C C H H H N C C H H H N
charge: 1
multiplicity: 1
keywords: wB97X-D3BJ Opt Freq def2-TZVPP def2/J RIJCOSX VeryTightSCF
keywords: PAL8 defgrid3 VeryTightOpt
frequency: 0.00 0.00 0.00 0.00 0.00 0.00 -4.58 -3.56 11.91 16.90 20.24 34.10 51.64 57.30 67.31 76.14 98.43 107.09 109.62 130.61 169.87 191.88 201.73 307.17 335.31 397.87 400.40 400.52 405.20 411.24 414.72 478.70 504.88 525.33 541.66 565.17 673.29 697.57 722.12 791.56 829.16 869.66 906.30 922.64 937.53 940.33 974.55 980.50 1037.10 1042.66 1064.08 1066.51 1067.08 1067.21 1067.33 1070.46 1087.94 1102.93 1182.12 1199.85 1246.68 1249.81 1292.70 1330.51 1373.97 1416.34 1420.68 1421.11 1432.48 1461.99 1475.76 1476.01 1478.48 1478.53 1487.46 1495.15 1529.26 1533.00 1611.79 1670.35 1689.32 1727.81 2412.09 2421.07 3086.02 3089.83 3089.95 3155.38 3174.89 3175.06 3176.19 3176.53 3196.26 3213.82 3219.03 3229.83 3238.93 3240.45 3309.80
frequency: 11.91 16.90 20.24 34.10 51.64 57.30 67.31 76.14 98.43 107.09 109.62 130.61 169.87 191.88 201.73 307.17 335.31 397.87 400.40 400.52 405.20 411.24 414.72 478.70 504.88 525.33 541.66 565.17 673.29 697.57 722.12 791.56 829.16 869.66 906.30 922.64 937.53 940.33 974.55 980.50 1037.10 1042.66 1064.08 1066.51 1067.08 1067.21 1067.33 1070.46 1087.94 1102.93 1182.12 1199.85 1246.68 1249.81 1292.70 1330.51 1373.97 1416.34 1420.68 1421.11 1432.48 1461.99 1475.76 1476.01 1478.48 1478.53 1487.46 1495.15 1529.26 1533.00 1611.79 1670.35 1689.32 1727.81 2412.09 2421.07 3086.02 3089.83 3089.95 3155.38 3174.89 3175.06 3176.19 3176.53 3196.26 3213.82 3219.03 3229.83 3238.93 3240.45 3309.80
formula: C14H15ClN3
InChI: InChI=1S/C10H9ClN.2C2H3N/c1-7-5-6-8-3-2-4-9(11)10(8)12-7;2*1-2-3/h2-6,12H,1H3;2*1H3
33 atoms
C  4.600892 -1.576744 -1.896097
C  3.355089 -1.012319 -1.966145
C  2.751815 -0.496636 -0.79746
C  3.441804 -0.5670 0.427306
C  4.727101 -1.155472 0.471549
C  5.291939 -1.650005 -0.669933
H  5.050886 -1.967578 -2.799673
C  2.805346 -0.034844 1.575311
H  5.247971 -1.204646 1.419913
H  6.27515 -2.10204 -0.645759
C  1.563296 0.528585 1.49717
C  0.903189 0.578809 0.257508
H  3.324633 -0.080926 2.526194
H  1.059425 0.944067 2.359871
N  1.50352 0.077025 -0.819031
H  0.988878 0.12358 -1.708955
C  -0.457063 1.178433 0.11086
H  -0.439562 1.981971 -0.626591
H  -1.162816 0.426148 -0.245065
H  -0.79036 1.566625 1.070186
Cl 2.521391 -0.92495 -3.468207
C  -1.147057 2.512701 4.503024
C  -1.838169 3.107126 5.643773
H  -1.108868 3.519887 6.340501
H  -2.496671 3.904457 5.299828
H  -2.430088 2.346232 6.15204
N  -0.603393 2.045098 3.606653
C  -1.159873 0.532618 -3.908182
C  -2.071242 0.654026 -5.040984
H  -2.657593 1.567508 -4.943865
H  -1.498748 0.689981 -5.967692
H  -2.741649 -0.204927 -5.064218
N  -0.441105 0.435227 -3.01991
totalener: -1167.30042834 hartree
nucrepener: 1255.99605157 hartree
electener: -2423.29647991 hartree
oneelecener: -4067.70849384 hartree
twoeener: 1644.41201393 hartree
kineticenergy: 1163.38860289 hartree
exchangeener: -86.135700147067 hartree
correlationener: -5.809480316498 hartree
xcener: -91.945180463565 hartree
temp: 298.15 k
press: 1.00 atm
thermalcorrenthalpy: 0.00094421 hartree
totalenthalpy: -1167.08632707 hartree
totalentropycorr: -0.06819971 hartree
gibbsenthalpy: -1167.15452678 hartree
gibbsminuselec: 0.21495950 hartree
chargesum: 1.0000000
charge: -0.082031 -0.023467 0.172373 -0.022673 -0.094561 -0.115966 0.147369 -0.027804 0.146879 0.157561 -0.107569 0.139361 0.152905 0.171163 -0.046972 0.223048 -0.226719 0.121190 0.122360 0.129832 -0.028349 -0.167552 -0.102183 0.133673 0.132577 0.134451 -0.100707 -0.116023 -0.097732 0.136094 0.137390 0.138410 -0.136325
charge: 0.009902 -0.387505 -0.093254 -0.056763 0.037694 0.022054 0.036567 0.093448 0.034857 0.034974 0.028349 -0.043462 0.046460 0.030991 0.446174 -0.023483 0.053315 0.033959 0.034903 0.032681 0.474144 -0.136628 0.027431 0.043661 0.043369 0.043557 0.025913 -0.114879 0.034831 0.046049 0.046660 0.046526 0.047503
qa: -0.0820 -0.0235 0.1724 -0.0227 -0.0946 -0.1160 0.1474 -0.0278 0.1469 0.1576 -0.1076 0.1394 0.1529 0.1712 -0.0470 0.2230 -0.2267 0.1212 0.1224 0.1298 -0.0283 -0.1676 -0.1022 0.1337 0.1326 0.1345 -0.1007 -0.1160 -0.0977 0.1361 0.1374 0.1384 -0.1363
va: 4.0006 4.0085 3.7330 3.8537 3.9720 4.0184 1.0007 3.9375 1.0009 0.9943 3.8562 3.8811 0.9966 1.0241 3.4872 1.0425 3.9106 1.0022 1.0016 1.0189 1.3000 3.9355 3.8435 0.9962 0.9967 0.9959 3.1118 3.8726 3.8461 0.9961 0.9957 0.9952 3.0928
dispcorr: -0.069064047 hartree
energy: -1167.370984172683
dipole: -15.54912 14.17017 -1.37895 9.81282 -9.08140 0.73142 13.51673 -12.84530 0.67143
magnitude: 1.69921 au
magnitude: 4.31904 debye
zeropoint: 0.26253087 hartree
thermalvibcorrection: 0.01636428 hartree
thermalrotcorrection: 0.00141627 hartree
thermaltrasncorrection: 0.00141627 hartree
thermaltotal: -1167.08925647 hartree
thermalcorr: 0.01919683 hartree
nonthermalcorr: 0.26253087 hartree
totalcorr: 0.28172770 hartree
totalenthalpy: -1167.08831226 hartree
