program: Orca
programVersion: 5.0.2
elementType: C C C C C C H C H C C H H N H H C H H H C H C H H H O H C H H H O C H H C H H H
charge: 1
multiplicity: 1
keywords: wB97X-D3BJ Opt Freq def2-TZVPP def2/J RIJCOSX VeryTightSCF
keywords: PAL8 defgrid3 VeryTightOpt
frequency: 0.00 0.00 0.00 0.00 0.00 0.00 20.46 25.20 36.28 43.90 54.75 78.28 93.34 111.00 116.10 131.01 156.01 187.74 224.41 237.20 254.24 260.04 278.09 303.47 331.62 364.85 368.00 373.35 418.04 435.59 462.94 484.34 493.61 525.97 549.93 589.33 628.10 678.22 706.41 784.52 789.72 831.92 840.59 851.07 860.90 872.06 917.82 924.85 943.16 959.19 970.48 984.03 1004.61 1016.02 1033.76 1043.31 1051.69 1085.23 1087.13 1127.19 1150.54 1158.72 1172.60 1186.79 1197.02 1202.92 1205.03 1263.63 1291.68 1305.58 1319.81 1332.97 1354.75 1387.37 1393.31 1404.58 1417.41 1433.97 1436.60 1442.81 1444.96 1446.88 1458.01 1482.50 1486.43 1490.50 1492.42 1499.64 1508.25 1508.62 1515.03 1527.78 1532.59 1574.66 1614.77 1675.75 1699.71 1739.47 3048.39 3060.22 3063.13 3065.37 3078.38 3079.06 3096.79 3133.49 3137.91 3148.52 3149.55 3158.18 3158.22 3163.05 3178.88 3214.93 3221.51 3223.33 3228.80 3241.01 3252.22 3879.02
frequency: 20.46 25.20 36.28 43.90 54.75 78.28 93.34 111.00 116.10 131.01 156.01 187.74 224.41 237.20 254.24 260.04 278.09 303.47 331.62 364.85 368.00 373.35 418.04 435.59 462.94 484.34 493.61 525.97 549.93 589.33 628.10 678.22 706.41 784.52 789.72 831.92 840.59 851.07 860.90 872.06 917.82 924.85 943.16 959.19 970.48 984.03 1004.61 1016.02 1033.76 1043.31 1051.69 1085.23 1087.13 1127.19 1150.54 1158.72 1172.60 1186.79 1197.02 1202.92 1205.03 1263.63 1291.68 1305.58 1319.81 1332.97 1354.75 1387.37 1393.31 1404.58 1417.41 1433.97 1436.60 1442.81 1444.96 1446.88 1458.01 1482.50 1486.43 1490.50 1492.42 1499.64 1508.25 1508.62 1515.03 1527.78 1532.59 1574.66 1614.77 1675.75 1699.71 1739.47 3048.39 3060.22 3063.13 3065.37 3078.38 3079.06 3096.79 3133.49 3137.91 3148.52 3149.55 3158.18 3158.22 3163.05 3178.88 3214.93 3221.51 3223.33 3228.80 3241.01 3252.22 3879.02
formula: C15H22NO2
InChI: InChI=1S/C12H14NO.C3H8O/c1-3-14-11-6-7-12-10(8-11)5-4-9(2)13-12;1-3(2)4/h4-8,13H,3H2,1-2H3;3-4H,1-2H3
40 atoms
C  0.390731 -3.408641 1.477817
C  0.097321 -2.370034 0.63291
C  0.273083 -1.050281 1.074511
C  0.746287 -0.791126 2.374572
C  1.04206 -1.867807 3.22557
C  0.87021 -3.166707 2.791948
H  -0.264537 -2.557896 -0.370712
C  0.900672 0.569128 2.755377
H  1.408585 -1.688729 4.22856
C  0.598852 1.579445 1.888326
C  0.125631 1.279696 0.595316
H  1.264183 0.796026 3.751375
H  0.7136 2.617332 2.170882
N  -0.013324 0.012173 0.247573
H  -0.374462 -0.206592 -0.694416
H  0.253318 -4.422214 1.129092
C  -2.984692 0.130997 -3.543267
H  -4.050685 -0.01138 -3.728164
H  -2.458539 -0.052148 -4.483473
H  -2.821321 1.170018 -3.248173
C  -2.511046 -0.813759 -2.453689
H  -2.683938 -1.850534 -2.760062
C  -3.188801 -0.562647 -1.120701
H  -2.813294 -1.240662 -0.351428
H  -3.028566 0.469117 -0.796587
H  -4.263363 -0.722068 -1.213388
O  -1.085788 -0.653186 -2.233642
H  -0.624787 -0.749362 -3.070392
C  -0.227877 2.342407 -0.39477
H  0.638348 2.981122 -0.576085
H  -0.559373 1.915341 -1.33989
H  -1.021727 2.973288 0.009799
O  1.175355 -4.139596 3.661166
C  1.02921 -5.512803 3.266885
H  -0.015811 -5.700065 3.000316
H  1.658042 -5.703267 2.391396
C  1.453837 -6.367924 4.438386
H  2.493644 -6.170889 4.701011
H  0.82801 -6.166355 5.30827
H  1.355623 -7.422668 4.176783
totalener: -790.43962292 hartree
nucrepener: 1302.72341624 hartree
electener: -2093.16303916 hartree
oneelecener: -3638.94424560 hartree
twoeener: 1545.78120643 hartree
kineticenergy: 786.85964457 hartree
exchangeener: -72.874405659040 hartree
correlationener: -5.531425173778 hartree
xcener: -78.405830832819 hartree
chargesum: 1.0000000
charge: -0.078832 -0.231175 0.162150 -0.026330 -0.127998 0.209072 0.126427 -0.047839 0.134702 -0.132926 0.146950 0.155091 0.156984 -0.034106 0.213031 0.133422 -0.240150 0.102152 0.088446 0.088368 0.116584 0.100558 -0.274181 0.091323 0.081530 0.117544 -0.376401 0.217323 -0.223368 0.139920 0.077893 0.131259 -0.217037 -0.014049 0.099924 0.100774 -0.262462 0.099509 0.099359 0.096561
charge: 0.026987 0.012546 -0.084848 -0.061526 0.036330 -0.194239 0.027850 0.092553 0.035782 0.014322 -0.066116 0.046122 0.038804 0.452224 -0.035869 0.028789 0.013076 0.026502 0.014654 0.015384 -0.173810 0.017840 0.011373 0.012517 0.013271 0.028092 0.309740 -0.128104 0.049905 0.039837 0.021855 0.039326 0.312481 -0.091900 0.012143 0.012463 0.015525 0.018317 0.018243 0.021557
qa: -0.0788 -0.2312 0.1621 -0.0263 -0.1280 0.2091 0.1264 -0.0478 0.1347 -0.1329 0.1470 0.1551 0.1570 -0.0341 0.2130 0.1334 -0.2401 0.1022 0.0884 0.0884 0.1166 0.1006 -0.2742 0.0913 0.0815 0.1175 -0.3764 0.2173 -0.2234 0.1399 0.0779 0.1313 -0.2170 -0.0140 0.0999 0.1008 -0.2625 0.0995 0.0994 0.0966
va: 3.9152 4.0343 3.8625 3.9412 3.9738 4.0971 1.0487 3.9681 1.0189 3.9534 3.8439 0.9960 0.9948 3.4690 1.0693 1.0111 3.9660 1.0102 1.0071 1.0010 3.8455 0.9911 3.9176 1.0047 1.0024 1.0117 2.0388 1.0225 3.9072 0.9971 1.0405 0.9930 2.1881 3.8510 0.9794 0.9794 3.9755 1.0043 1.0042 1.0045
dispcorr: -0.076300795 hartree
energy: -790.516599078545
dipole: -10.99128 10.73726 -0.25402 -0.80926 1.98812 1.17886 -12.14088 10.91515 -1.22574
magnitude: 1.71950 au
magnitude: 4.37061 debye
temp: 298.15 k
press: 1.00 atm
zeropoint: 0.35023886 hartree
thermalvibcorrection: 0.01694826 hartree
thermalrotcorrection: 0.00141627 hartree
thermaltrasncorrection: 0.00141627 hartree
thermaltotal: -790.14657942 hartree
thermalcorr: 0.01978080 hartree
nonthermalcorr: 0.35023886 hartree
totalcorr: 0.37001966 hartree
thermalcorrenthalpy: 0.00094421 hartree
totalenthalpy: -790.14563521 hartree
totalentropycorr: -0.06702113 hartree
gibbsenthalpy: -790.21265634 hartree
gibbsminuselec: 0.30394274 hartree
