program: Gaussian 09
title: 000034581
version: EM64L-G09RevD.01
frameworkgroup: C1[X(C16H16)]
method: RPBEPBE
basis: SDD
operation: Freq
keyword: #p
keyword: freq=noraman
keyword: PBEPBE/SDD
title: #p freq=noraman PBEPBE/SDD
converged: YES YES NO NO
title: Mulliken charges:
elementType: C C C C C C C C C C C C C C C C H H H H H H H H H H H H H H H H
charge: -0.225351 -0.465754 -0.593633 -0.556576 0.288384 0.291853 0.523511 -0.393677 -0.396269 -0.468882 -0.392422 -0.250822 -0.248447 -0.223230 -0.251896 -0.246838 0.220095 0.209237 0.223777 0.233987 0.230629 0.224561 0.221157 0.232361 0.230327 0.232664 0.227000 0.225310 0.225268 0.223781 0.222675 0.227221
chargesum: 0.00000
title: Mulliken charges with hydrogens summed into heavy atoms:
elementType: C C C C C C C C C C C C C C C C
charge: -0.005256 -0.032740 -0.129017 -0.110858 0.288384 0.291853 0.523511 -0.161317 -0.165942 -0.236218 -0.165422 -0.025512 -0.023179 0.000551 -0.029221 -0.019617
polarizability: 2.33707452e+02 -5.50094849e+00 1.35131941e+02 -4.12146906e-01 1.39109223e+00 1.21105396e+02
1716.lowfreq: -11.3980 -0.0007 -0.0007 -0.0005 2.9817 14.5921 27.5129 47.6898 76.6602
frequency: 27.4025 47.6423 76.6395 120.4261 159.7116 229.4270 240.5450 259.9676 283.9785 358.1854 403.7087 427.7912 441.7901 473.7932 510.0148 531.2050 547.3620 585.2433 617.2312 640.5631 705.7780 708.2741 724.2551 750.3967 767.9679 795.2750 826.4402 850.5952 868.7285 890.5343 898.3516 913.0139 921.4029 955.5116 972.9001 985.3618 990.1481 992.1766 1014.1130 1027.2613 1035.7152 1056.8260 1085.7417 1103.0095 1109.5283 1139.6369 1171.1434 1172.7391 1187.8050 1194.8044 1200.5640 1206.0928 1218.7496 1248.7661 1256.6202 1288.7065 1303.2806 1326.8012 1332.2008 1342.7865 1364.7097 1381.1483 1387.0580 1438.6012 1442.4634 1451.7669 1457.7125 1467.8674 1483.2873 1489.5634 1590.2249 1591.7411 1612.9603 1613.8181 2956.2587 2958.9857 2971.3950 2984.7069 3018.5850 3024.1079 3049.5628 3107.7324 3112.0130 3113.3443 3114.5188 3130.6048 3134.2688 3141.4409 3157.0926 3160.7731
redmass: 3.7986 3.9287 4.1944 2.6394 3.1337 4.8699 3.8038 2.6564 2.5776 3.6596 2.8064 2.4729 3.5690 2.7862 3.6642 3.1121 4.3296 4.1828 6.3534 4.6254 1.6768 3.1842 3.9580 1.2336 2.0125 2.3763 3.0771 1.2489 1.4474 2.0219 1.8867 1.7435 1.9530 1.4137 1.3912 1.3198 6.2728 1.3158 2.4732 2.1516 2.4368 2.0699 1.6567 2.7648 1.8886 1.1878 1.0554 1.0605 1.1104 2.4741 1.3632 1.9063 1.7055 1.5745 1.4571 1.4930 1.3326 1.3748 1.3437 1.4928 1.8545 5.5966 3.8961 2.3530 2.0553 1.1561 1.1035 1.1078 2.2804 2.2741 6.5294 5.9526 6.2539 6.3409 1.0645 1.0670 1.0761 1.0657 1.0936 1.0971 1.1023 1.0865 1.0892 1.0862 1.0871 1.0907 1.0924 1.0958 1.1004 1.1014
irintensity: 0.0413 0.0602 0.0905 0.2019 0.0633 0.1337 1.5318 5.5728 0.5206 0.2348 0.0110 6.0508 2.7051 0.9261 1.8080 12.6301 3.0131 2.5852 0.1579 0.3324 52.9098 0.3640 1.1059 72.2134 44.7822 4.8237 3.0593 0.0262 1.1395 1.7915 4.7797 4.7238 4.9836 4.1495 0.1278 0.0053 0.1967 0.0990 1.0527 6.7178 4.5907 9.2084 9.0894 0.9164 7.6924 0.9622 0.0532 0.1409 0.1115 0.3035 1.8997 0.3064 0.4968 1.2966 5.6525 0.8413 0.9486 1.5549 0.0616 1.5150 0.1612 2.6182 0.2964 4.3407 8.1000 3.9001 15.2496 8.1956 29.3354 21.5558 5.8494 1.8611 5.3188 7.8245 30.4678 9.7296 16.8685 37.3764 33.9046 25.1356 41.7896 17.5815 1.7425 11.3718 7.9454 11.7182 29.7851 46.6288 41.4197 26.0626
temp: 298.150 k
press: 1.00000 atm
elementType: 6 6 6 6 6 6 6 6 6 6 6 6 6 6 6 6 1 1 1 1 1 1 1 1 1 1 1 1 1 1 1 1
symmnumber: 1
zpe: 708374.4 jmol-1
zpe.correction: 0.269806 hartree
zpe.thermalcorrener: 0.282615 hartree
zpe.thermalcorrenthalpy: 0.283559 hartree
zpe.thermalcorrgfe: 0.229508 hartree
zpe.sumelectzpe: -618.185751 hartree
zpe.sumelectthermal: -618.172941 hartree
zpe.sumelectthermalent: -618.171997 hartree
zpe.sumelectthermalfe: -618.226048 hartree
dipole: 0.2650 0.3405 0.0317
dipole: 0.4326
quadrupole: -89.5469 -92.6131 -92.6881
quadrupole: -2.1339 0.0115 0.4169
quadrupole: 2.0691 -0.9970 -1.0721 -2.1339 0.0115 0.4169
hfenergy: -618.4555564 hartree
pointgroup: C01 [X(C16H16)]
dipole: 0.1051395 0.1231733 0.0523712 debye
polarizability: 233.6196498|-6.117085|133.205673|-1.3449283|5.1143074|123.1194658 unknown
InChI: InChI=1S/C16H16/c1-2-6-13(7-3-1)16-11-10-14-8-4-5-9-15(14)12-16/h1-9,16H,10-12H2
charge 0 multiplicity 1
32 atoms
C  0.536682 0.227832 0.473412
C  0.049763 1.665516 0.145942
C  -0.329515 -0.787124 -0.322192
C  -1.403652 1.866713 0.624558
C  -1.829927 -0.529212 -0.206852
C  -2.338901 0.732342 0.211782
C  2.025984 0.02356 0.207914
C  -2.741386 -1.562289 -0.546042
C  -3.743046 0.9249 0.26964
C  2.886109 -0.442821 1.234524
C  2.58767 0.281852 -1.071324
C  -4.136202 -1.362716 -0.483582
C  -4.641873 -0.106514 -0.07321
C  4.265137 -0.64596 0.996842
C  3.964235 0.082431 -1.314201
C  4.810384 -0.38358 -0.280346
H  0.354038 0.057705 1.555076
H  0.111167 1.833444 -0.94781
H  0.712322 2.409554 0.626363
H  -0.097395 -1.817752 0.00864
H  -0.032885 -0.738635 -1.390945
H  -1.798692 2.830038 0.247576
H  -1.408275 1.947592 1.732192
H  -2.345855 -2.535888 -0.863394
H  -4.133106 1.900277 0.58867
H  2.469907 -0.647732 2.229116
H  1.947224 0.645784 -1.884333
H  -4.821712 -2.175029 -0.75012
H  -5.723027 0.065059 -0.022338
H  4.911148 -1.006822 1.805495
H  4.378345 0.289234 -2.307887
H  5.878732 -0.538859 -0.468364
