program: Orca
programVersion: 5.0.2
elementType: C C C C C C H C H H C C H H N H H C H H C H H H O H H O H H O H H
charge: 1
multiplicity: 1
keywords: wB97X-D3BJ Opt Freq def2-TZVPP def2/J RIJCOSX VeryTightSCF
keywords: PAL8 defgrid3 VeryTightOpt
frequency: 0.00 0.00 0.00 0.00 0.00 0.00 -9.86 9.67 20.11 23.39 36.06 65.13 71.18 80.61 109.84 114.86 130.52 177.26 181.93 189.51 228.27 235.52 240.67 247.81 256.91 288.56 301.07 333.35 401.31 416.40 490.58 522.20 539.95 547.87 617.04 633.83 662.68 696.47 704.83 708.39 766.61 798.39 811.66 823.41 879.72 897.76 922.84 981.46 1022.94 1025.30 1053.98 1057.59 1061.06 1109.07 1112.07 1161.92 1165.43 1178.55 1198.17 1246.81 1265.28 1310.20 1316.78 1350.51 1373.25 1414.68 1432.29 1439.82 1467.59 1476.40 1510.47 1518.29 1531.55 1559.68 1621.10 1641.51 1646.80 1674.90 1685.42 1700.44 1744.55 2972.33 3068.79 3074.90 3112.70 3149.50 3159.49 3211.78 3213.11 3218.68 3230.21 3237.21 3263.91 3644.47 3698.49 3859.52 3863.91 3951.61 3956.59
frequency: 9.67 20.11 23.39 36.06 65.13 71.18 80.61 109.84 114.86 130.52 177.26 181.93 189.51 228.27 235.52 240.67 247.81 256.91 288.56 301.07 333.35 401.31 416.40 490.58 522.20 539.95 547.87 617.04 633.83 662.68 696.47 704.83 708.39 766.61 798.39 811.66 823.41 879.72 897.76 922.84 981.46 1022.94 1025.30 1053.98 1057.59 1061.06 1109.07 1112.07 1161.92 1165.43 1178.55 1198.17 1246.81 1265.28 1310.20 1316.78 1350.51 1373.25 1414.68 1432.29 1439.82 1467.59 1476.40 1510.47 1518.29 1531.55 1559.68 1621.10 1641.51 1646.80 1674.90 1685.42 1700.44 1744.55 2972.33 3068.79 3074.90 3112.70 3149.50 3159.49 3211.78 3213.11 3218.68 3230.21 3237.21 3263.91 3644.47 3698.49 3859.52 3863.91 3951.61 3956.59
formula: C11H18NO3
InChI: InChI=1S/C11H12N.3H2O/c1-2-10-8-7-9-5-3-4-6-11(9)12-10;;;/h3-8,12H,2H2,1H3;3*1H2
33 atoms
C  3.173148 -0.901038 -0.246345
C  1.90324 -1.403825 -0.15519
C  0.828111 -0.50221 -0.033408
C  1.046308 0.887328 -0.003981
C  2.374495 1.371029 -0.102029
C  3.413864 0.492957 -0.22088
H  1.706636 -2.468734 -0.169428
C  -0.083229 1.726973 0.121261
H  2.546851 2.440567 -0.080492
H  4.43008 0.85881 -0.295588
C  -1.345588 1.202704 0.21423
C  -1.524959 -0.189763 0.183596
H  0.061543 2.801611 0.143375
H  -2.208287 1.844831 0.308569
N  -0.457929 -0.968634 0.058503
H  -0.596561 -2.005398 0.023169
H  4.011324 -1.580958 -0.338838
C  -2.858274 -0.875978 0.304527
H  -2.882895 -1.687438 -0.42688
H  -2.881762 -1.361591 1.285935
C  -4.069896 0.034339 0.139554
H  -4.981818 -0.560572 0.183173
H  -4.128497 0.779934 0.934027
H  -4.054358 0.551539 -0.821571
O  -0.739977 -3.645825 -0.012002
H  -1.104687 -4.136174 0.742473
H  -0.798112 -4.213514 -0.797697
O  -0.820441 -5.177363 -2.351818
H  -0.078735 -5.700645 -2.663668
H  -1.590643 -5.5125 -2.81597
O  -1.71877 -4.822997 2.331079
H  -1.100391 -5.15436 2.986634
H  -2.51509 -5.348534 2.43721
totalener: -710.78098632 hartree
nucrepener: 982.14073508 hartree
electener: -1692.92172140 hartree
oneelecener: -2899.85976149 hartree
twoeener: 1206.93804009 hartree
kineticenergy: 707.82761372 hartree
exchangeener: -63.859063004458 hartree
correlationener: -4.738085801762 hartree
xcener: -68.597148806220 hartree
temp: 298.15 k
press: 1.00 atm
thermalcorrenthalpy: 0.00094421 hartree
totalenthalpy: -710.54167466 hartree
totalentropycorr: -0.06161906 hartree
gibbsenthalpy: -710.60329372 hartree
gibbsminuselec: 0.23678072 hartree
chargesum: 1.0000000
charge: -0.047856 -0.192390 0.153590 -0.023755 -0.090970 -0.125472 0.126761 -0.043416 0.145023 0.154745 -0.119491 0.141591 0.153098 0.149245 -0.054004 0.223439 0.154076 -0.103012 0.101484 0.116162 -0.271717 0.111994 0.092202 0.106994 -0.488481 0.254297 0.258271 -0.423042 0.241673 0.239864 -0.422766 0.242254 0.239607
charge: 0.034484 0.016484 -0.068767 -0.059166 0.037355 0.019534 0.027053 0.090934 0.033627 0.032178 0.013665 -0.046492 0.045263 0.034270 0.448880 -0.057135 0.033865 -0.011759 0.035005 0.041706 0.022764 0.022675 0.015340 0.018388 0.353482 -0.173196 -0.173113 0.334776 -0.113777 -0.114705 0.334157 -0.113064 -0.114710
qa: -0.0479 -0.1924 0.1536 -0.0238 -0.0910 -0.1255 0.1268 -0.0434 0.1450 0.1547 -0.1195 0.1416 0.1531 0.1492 -0.0540 0.2234 0.1541 -0.1030 0.1015 0.1162 -0.2717 0.1120 0.0922 0.1070 -0.4885 0.2543 0.2583 -0.4230 0.2417 0.2399 -0.4228 0.2423 0.2396
va: 3.9959 4.0031 3.9034 3.8749 3.9666 4.0417 1.0597 3.9806 1.0021 0.9955 3.9101 3.8757 0.9966 1.0000 3.4381 1.0718 0.9944 3.8845 1.0195 1.0013 3.9422 1.0037 0.9980 0.9981 2.0113 1.0517 1.0494 2.0765 1.0118 1.0129 2.0776 1.0108 1.0132
dispcorr: -0.058940110 hartree
energy: -710.844914742198
dipole: -11.95721 11.23246 -0.72475 -9.59119 8.09868 -1.49252 0.32748 -0.29122 0.03626
magnitude: 1.65957 au
magnitude: 4.21830 debye
zeropoint: 0.28050450 hartree
thermalvibcorrection: 0.01664314 hartree
thermalrotcorrection: 0.00141627 hartree
thermaltrasncorrection: 0.00141627 hartree
thermaltotal: -710.54493455 hartree
thermalcorr: 0.01947569 hartree
nonthermalcorr: 0.28050450 hartree
totalcorr: 0.29998019 hartree
totalenthalpy: -710.54399034 hartree
