program: Orca
programVersion: 5.0.3
elementType: O O C C C C C C C C C C C C C C C C C C C C C H H H H H H H H H H H H H H H H H H H H H H H H H H
charge: 0
multiplicity: 1
keywords: wB97X-D3 TightOpt Freq def2-TZVPP def2/J RIJCOSX VeryTightSCF defgrid3
frequency: 0.00 0.00 0.00 0.00 0.00 0.00 17.88 24.42 25.83 44.69 69.54 80.46 85.55 92.22 131.51 154.27 175.36 215.76 217.10 237.44 242.01 248.80 261.48 278.40 283.85 310.90 320.77 329.03 337.81 354.47 365.12 380.60 392.84 419.95 451.68 474.60 497.68 515.31 542.46 563.19 572.38 596.30 617.24 639.87 674.28 683.49 705.87 724.68 737.74 769.63 814.33 821.63 848.50 849.52 867.84 883.97 893.15 906.37 919.88 939.26 945.62 948.97 968.68 996.61 1001.37 1017.14 1027.36 1032.36 1061.60 1064.16 1074.29 1095.76 1104.00 1129.23 1130.85 1136.86 1169.14 1193.78 1200.23 1209.88 1224.32 1236.34 1241.58 1262.63 1270.49 1288.02 1318.28 1323.10 1325.91 1340.21 1341.90 1344.32 1352.05 1368.75 1389.83 1406.16 1410.43 1415.69 1421.78 1421.95 1425.84 1457.07 1483.27 1486.40 1489.70 1491.09 1494.72 1496.02 1498.01 1501.42 1503.43 1504.70 1506.91 1512.05 1513.48 1559.50 1567.76 1651.11 1668.29 1699.95 1705.47 3029.60 3047.19 3047.82 3050.34 3056.62 3058.33 3062.43 3071.44 3075.08 3091.61 3103.40 3103.77 3124.05 3124.17 3129.14 3144.80 3146.44 3148.46 3156.54 3161.32 3170.60 3188.67 3213.04 3215.86 3251.77 3910.02
frequency: 17.88 24.42 25.83 44.69 69.54 80.46 85.55 92.22 131.51 154.27 175.36 215.76 217.10 237.44 242.01 248.80 261.48 278.40 283.85 310.90 320.77 329.03 337.81 354.47 365.12 380.60 392.84 419.95 451.68 474.60 497.68 515.31 542.46 563.19 572.38 596.30 617.24 639.87 674.28 683.49 705.87 724.68 737.74 769.63 814.33 821.63 848.50 849.52 867.84 883.97 893.15 906.37 919.88 939.26 945.62 948.97 968.68 996.61 1001.37 1017.14 1027.36 1032.36 1061.60 1064.16 1074.29 1095.76 1104.00 1129.23 1130.85 1136.86 1169.14 1193.78 1200.23 1209.88 1224.32 1236.34 1241.58 1262.63 1270.49 1288.02 1318.28 1323.10 1325.91 1340.21 1341.90 1344.32 1352.05 1368.75 1389.83 1406.16 1410.43 1415.69 1421.78 1421.95 1425.84 1457.07 1483.27 1486.40 1489.70 1491.09 1494.72 1496.02 1498.01 1501.42 1503.43 1504.70 1506.91 1512.05 1513.48 1559.50 1567.76 1651.11 1668.29 1699.95 1705.47 3029.60 3047.19 3047.82 3050.34 3056.62 3058.33 3062.43 3071.44 3075.08 3091.61 3103.40 3103.77 3124.05 3124.17 3129.14 3144.80 3146.44 3148.46 3156.54 3161.32 3170.60 3188.67 3213.04 3215.86 3251.77 3910.02
formula: C21H26O2
InChI: InChI=1S/C21H26O2/c1-5-6-7-8-15-12-18(22)20-16-11-14(2)9-10-17(16)21(3,4)23-19(20)13-15/h9-13,22H,5-8H2,1-4H3
49 atoms
O  -0.691749 2.014145 -0.1723
O  0.300948 -2.567801 -1.008231
C  -1.59769 1.677286 0.895844
C  -2.364488 0.427747 0.508485
C  -1.695049 -0.566312 -0.216364
C  -0.296617 -0.30185 -0.609652
C  0.135129 1.031882 -0.598676
C  -0.794667 1.444343 2.176871
C  -2.474223 2.91133 1.02972
C  2.298381 0.457836 -1.462486
C  3.701128 0.849344 -1.843616
C  1.391097 1.415413 -1.037795
C  -3.686007 0.229089 0.876987
C  0.642521 -1.250573 -1.028669
C  -2.395065 -1.716774 -0.579992
C  4.575453 1.280529 -0.6572
C  1.912053 -0.874291 -1.449668
C  -3.720505 -1.913975 -0.217739
C  4.7690 0.216469 0.428876
C  -4.357153 -0.930065 0.527362
C  3.707418 0.21108 1.527708
C  -4.455504 -3.152902 -0.65188
C  3.957708 -0.86643 2.573944
H  -0.203296 2.329376 2.415089
H  -1.47224 1.236435 3.005033
H  -0.12222 0.592856 2.070802
H  -3.074643 3.056476 0.13261
H  -3.136004 2.834667 1.891062
H  -1.83768 3.784522 1.168483
H  4.183411 0.009875 -2.350629
H  3.661191 1.669154 -2.565091
H  1.651595 2.465366 -1.002597
H  -4.208714 0.985977 1.447071
H  -1.895619 -2.47708 -1.160523
H  4.155436 2.185115 -0.207219
H  5.549776 1.567736 -1.059629
H  2.614207 -1.642282 -1.759079
H  4.813365 -0.775091 -0.036509
H  5.744914 0.365301 0.900711
H  -5.388633 -1.065139 0.831974
H  2.716242 0.072313 1.092633
H  3.692387 1.19476 2.007266
H  -5.194318 -3.45619 0.090195
H  -4.985684 -2.980099 -1.591085
H  -3.770097 -3.985195 -0.809368
H  1.054898 -3.085743 -1.290235
H  3.200912 -0.844311 3.359063
H  3.936544 -1.861269 2.123276
H  4.933791 -0.741185 3.048336
totalener: -966.45315561 hartree
nucrepener: 1973.99988396 hartree
electener: -2940.45303957 hartree
oneelecener: -5233.33757157 hartree
twoeener: 2292.88453200 hartree
kineticenergy: 961.93776230 hartree
xcener: -96.652365275510 hartree
chargesum: -0.0000000
charge: -0.317504 -0.306149 0.385062 -0.171891 0.073101 -0.086147 0.200244 -0.295721 -0.284698 0.099825 -0.153494 -0.288819 -0.105553 0.286620 -0.138138 -0.118478 -0.240282 0.001324 -0.136128 -0.134246 -0.047880 -0.225369 -0.251922 0.095577 0.094940 0.102339 0.114106 0.073286 0.098039 0.074999 0.094540 0.094928 0.115298 0.106740 0.065305 0.078284 0.059140 0.052347 0.075222 0.105381 0.028250 0.055619 0.084358 0.099551 0.085043 0.176819 0.084267 0.069424 0.072440
charge: 0.314601 0.362304 -0.236628 -0.043035 -0.040118 -0.064985 -0.187065 0.028790 0.021914 -0.077380 -0.012905 -0.017834 -0.003655 -0.174802 0.023046 -0.021209 -0.043338 -0.086636 -0.031964 -0.010545 -0.044648 0.019807 -0.004284 0.018004 0.020419 0.020243 0.021977 0.014630 0.020209 0.025385 0.028585 0.023831 0.021467 0.015531 0.019737 0.017433 0.011616 0.017188 0.017646 0.019536 0.018222 0.014570 0.017268 0.019944 0.018096 -0.116370 0.008456 0.008557 0.008390
qa: -0.3175 -0.3061 0.3851 -0.1719 0.0731 -0.0861 0.2002 -0.2957 -0.2847 0.0998 -0.1535 -0.2888 -0.1056 0.2866 -0.1381 -0.1185 -0.2403 0.0013 -0.1361 -0.1342 -0.0479 -0.2254 -0.2519 0.0956 0.0949 0.1023 0.1141 0.0733 0.0980 0.0750 0.0945 0.0949 0.1153 0.1067 0.0653 0.0783 0.0591 0.0523 0.0752 0.1054 0.0282 0.0556 0.0844 0.0996 0.0850 0.1768 0.0843 0.0694 0.0724
va: 2.1323 2.1612 3.7832 3.9115 3.7844 3.5396 3.9613 3.9487 3.9172 3.7011 3.8860 4.0790 3.9256 3.8243 3.9524 3.8755 3.9430 3.8430 3.8919 4.0245 3.8541 3.9182 3.9568 1.0103 1.0100 1.0002 1.0085 1.0068 1.0151 1.0094 1.0070 1.0313 1.0012 1.0549 1.0102 1.0103 1.0325 1.0099 1.0075 1.0085 1.0328 1.0114 1.0031 0.9918 1.0055 1.0557 1.0067 1.0034 1.0044
dispcorr: -0.024885816 hartree
energy: -966.478041487320
dipole: 15.46614 -15.09826 0.36788 1.37504 -1.73674 -0.36170 11.38014 -11.26528 0.11487
magnitude: 0.52854 au
magnitude: 1.34345 debye
temp: 298.15 k
press: 1.00 atm
zeropoint: 0.42583332 hartree
thermalvibcorrection: 0.01969944 hartree
thermalrotcorrection: 0.00141627 hartree
thermaltrasncorrection: 0.00141627 hartree
thermaltotal: -966.02967618 hartree
thermalcorr: 0.02253198 hartree
nonthermalcorr: 0.42583332 hartree
totalcorr: 0.44836530 hartree
thermalcorrenthalpy: 0.00094421 hartree
totalenthalpy: -966.02873198 hartree
totalentropycorr: -0.07177286 hartree
gibbsenthalpy: -966.10050484 hartree
gibbsminuselec: 0.37753665 hartree
