program: Orca
programVersion: 5.0.3
elementType: O O C C C C C C C C C C C C C C C C C C C C C H H H H H H H H H H H H H H H H H H H H H H H H H H
charge: 0
multiplicity: 1
keywords: wB97X-D3 TightOpt Freq def2-TZVPP def2/J RIJCOSX VeryTightSCF defgrid3
frequency: 0.00 0.00 0.00 0.00 0.00 0.00 18.01 25.30 32.66 53.31 66.33 81.15 85.64 103.47 137.56 147.95 181.80 216.93 231.41 233.29 245.46 250.88 261.03 278.98 282.39 306.85 318.99 323.22 338.91 360.40 366.53 382.80 394.32 420.01 449.23 481.93 501.38 514.10 542.96 555.93 572.84 595.20 620.13 639.10 675.64 686.57 703.77 724.45 738.36 769.74 814.27 822.12 849.12 853.20 868.64 882.39 891.49 904.59 922.76 938.94 947.09 949.02 968.41 996.65 1004.88 1017.70 1027.34 1030.74 1060.27 1064.97 1074.25 1098.04 1102.31 1128.47 1131.42 1136.78 1169.97 1194.07 1200.35 1210.87 1220.68 1236.24 1241.72 1261.28 1270.53 1287.12 1319.69 1323.24 1327.24 1339.11 1341.48 1343.18 1353.65 1367.41 1385.91 1405.70 1409.36 1415.30 1421.21 1421.71 1425.65 1457.72 1483.01 1485.57 1490.64 1491.82 1495.03 1497.15 1498.30 1502.10 1502.68 1504.85 1506.63 1512.64 1513.49 1559.25 1570.53 1650.63 1667.34 1700.00 1705.15 3035.40 3044.86 3047.01 3049.26 3058.43 3058.70 3062.57 3074.84 3075.02 3091.28 3104.04 3106.17 3123.90 3124.33 3127.92 3145.00 3146.03 3148.44 3156.57 3161.56 3166.86 3189.17 3216.40 3216.79 3252.43 3910.04
frequency: 18.01 25.30 32.66 53.31 66.33 81.15 85.64 103.47 137.56 147.95 181.80 216.93 231.41 233.29 245.46 250.88 261.03 278.98 282.39 306.85 318.99 323.22 338.91 360.40 366.53 382.80 394.32 420.01 449.23 481.93 501.38 514.10 542.96 555.93 572.84 595.20 620.13 639.10 675.64 686.57 703.77 724.45 738.36 769.74 814.27 822.12 849.12 853.20 868.64 882.39 891.49 904.59 922.76 938.94 947.09 949.02 968.41 996.65 1004.88 1017.70 1027.34 1030.74 1060.27 1064.97 1074.25 1098.04 1102.31 1128.47 1131.42 1136.78 1169.97 1194.07 1200.35 1210.87 1220.68 1236.24 1241.72 1261.28 1270.53 1287.12 1319.69 1323.24 1327.24 1339.11 1341.48 1343.18 1353.65 1367.41 1385.91 1405.70 1409.36 1415.30 1421.21 1421.71 1425.65 1457.72 1483.01 1485.57 1490.64 1491.82 1495.03 1497.15 1498.30 1502.10 1502.68 1504.85 1506.63 1512.64 1513.49 1559.25 1570.53 1650.63 1667.34 1700.00 1705.15 3035.40 3044.86 3047.01 3049.26 3058.43 3058.70 3062.57 3074.84 3075.02 3091.28 3104.04 3106.17 3123.90 3124.33 3127.92 3145.00 3146.03 3148.44 3156.57 3161.56 3166.86 3189.17 3216.40 3216.79 3252.43 3910.04
formula: C21H26O2
InChI: InChI=1S/C21H26O2/c1-5-6-7-8-15-12-18(22)20-16-11-14(2)9-10-17(16)21(3,4)23-19(20)13-15/h9-13,22H,5-8H2,1-4H3
49 atoms
O  -0.412999 1.398439 1.360928
O  0.170962 -2.788469 -0.833597
C  -1.478802 1.779226 0.469769
C  -2.321916 0.556035 0.16631
C  -1.678948 -0.682437 0.039808
C  -0.222472 -0.72428 0.279711
C  0.344246 0.342483 0.985925
C  -2.224514 2.8578 1.237832
C  -0.87498 2.35092 -0.814086
C  2.524308 -0.660092 0.980317
C  4.001133 -0.592553 1.261746
C  1.680726 0.368909 1.358029
C  -3.692372 0.634895 -0.02398
C  0.655333 -1.750034 -0.09907
C  -2.448746 -1.810684 -0.242052
C  4.841762 -0.157447 0.050967
C  1.997474 -1.716871 0.247454
C  -3.822528 -1.733727 -0.428985
C  4.481106 1.218945 -0.520394
C  -4.436615 -0.492894 -0.326525
C  3.423609 1.199787 -1.623332
C  -4.62537 -2.975643 -0.706252
C  3.018313 2.598964 -2.065404
H  -1.517393 3.629825 1.539388
H  -2.991828 3.323673 0.621466
H  -2.689988 2.442918 2.130929
H  -1.670851 2.681677 -1.481414
H  -0.231351 3.200245 -0.581509
H  -0.28523 1.599949 -1.340166
H  4.17627 0.107145 2.082151
H  4.352363 -1.569877 1.602072
H  2.045645 1.225039 1.910003
H  -4.196722 1.588537 0.061363
H  -1.9666 -2.773156 -0.317609
H  4.758437 -0.911167 -0.738397
H  5.88868 -0.160863 0.363066
H  2.646187 -2.525115 -0.077047
H  4.14271 1.871401 0.29212
H  5.383629 1.689463 -0.921258
H  -5.506317 -0.405021 -0.477862
H  2.538948 0.657575 -1.28449
H  3.815759 0.639476 -2.477863
H  -4.947109 -3.445941 0.225604
H  -5.520459 -2.748025 -1.285173
H  -4.040222 -3.709971 -1.259455
H  0.892393 -3.383468 -1.037901
H  3.878827 3.169265 -2.422783
H  2.282146 2.567626 -2.869735
H  2.576905 3.153831 -1.234419
totalener: -966.45303537 hartree
nucrepener: 1983.15834522 hartree
electener: -2949.61138060 hartree
oneelecener: -5251.65861504 hartree
twoeener: 2302.04723445 hartree
kineticenergy: 961.93690060 hartree
xcener: -96.652529334481 hartree
chargesum: -0.0000000
charge: -0.317708 -0.306006 0.395005 -0.170083 0.070708 -0.072128 0.187124 -0.284261 -0.306465 0.108333 -0.159178 -0.284680 -0.107619 0.277500 -0.139820 -0.122485 -0.241085 0.001615 -0.133577 -0.131785 -0.053803 -0.225590 -0.278035 0.098049 0.073455 0.113998 0.097454 0.093978 0.102513 0.082752 0.088668 0.093804 0.115405 0.107494 0.062069 0.078454 0.062409 0.057223 0.078807 0.104884 0.035616 0.059157 0.099750 0.082762 0.086671 0.176497 0.081746 0.088135 0.072273
charge: 0.315594 0.362024 -0.236019 -0.042862 -0.040104 -0.064778 -0.187239 0.022034 0.028352 -0.077957 -0.013037 -0.019159 -0.003548 -0.174524 0.023324 -0.020825 -0.042386 -0.086681 -0.030979 -0.010992 -0.044531 0.019762 -0.006039 0.020252 0.014740 0.021934 0.020855 0.017360 0.020727 0.028008 0.026224 0.021786 0.021534 0.015561 0.018451 0.017004 0.013942 0.018887 0.016844 0.019267 0.018460 0.013417 0.019990 0.017046 0.018300 -0.116333 0.008920 0.008358 0.009036
qa: -0.3177 -0.3060 0.3950 -0.1701 0.0707 -0.0721 0.1871 -0.2843 -0.3065 0.1083 -0.1592 -0.2847 -0.1076 0.2775 -0.1398 -0.1225 -0.2411 0.0016 -0.1336 -0.1318 -0.0538 -0.2256 -0.2780 0.0980 0.0735 0.1140 0.0975 0.0940 0.1025 0.0828 0.0887 0.0938 0.1154 0.1075 0.0621 0.0785 0.0624 0.0572 0.0788 0.1049 0.0356 0.0592 0.0997 0.0828 0.0867 0.1765 0.0817 0.0881 0.0723
va: 2.1326 2.1610 3.7650 3.9038 3.7939 3.5294 3.9880 3.9182 3.9533 3.6784 3.8905 4.0535 3.9294 3.8242 3.9505 3.8698 3.9573 3.8431 3.8811 4.0224 3.8357 3.9185 3.9617 1.0151 1.0067 1.0085 1.0120 1.0088 0.9980 1.0084 1.0078 1.0319 1.0013 1.0553 1.0100 1.0111 1.0303 1.0109 1.0063 1.0088 1.0341 1.0115 0.9919 1.0042 1.0042 1.0559 1.0062 1.0041 1.0009
dispcorr: -0.025621410 hartree
energy: -966.478657173320
dipole: 12.97821 -12.65473 0.32348 11.38493 -11.68303 -0.29810 -8.58295 8.17150 -0.41145
magnitude: 0.60232 au
magnitude: 1.53099 debye
temp: 298.15 k
press: 1.00 atm
zeropoint: 0.42597859 hartree
thermalvibcorrection: 0.01961056 hartree
thermalrotcorrection: 0.00141627 hartree
thermaltrasncorrection: 0.00141627 hartree
thermaltotal: -966.03023548 hartree
thermalcorr: 0.02244310 hartree
nonthermalcorr: 0.42597859 hartree
totalcorr: 0.44842170 hartree
thermalcorrenthalpy: 0.00094421 hartree
totalenthalpy: -966.02929127 hartree
totalentropycorr: -0.07142936 hartree
gibbsenthalpy: -966.10072062 hartree
gibbsminuselec: 0.37793655 hartree
