program: Orca
programVersion: 5.0.3
elementType: O O C C C C C C C C C C C C C C C C C C C C C H H H H H H H H H H H H H H H H H H H H H H H H H H H H H H
charge: 0
multiplicity: 1
keywords: DLPNO-CCSD(T) def2-TZVPP def2-TZVPP/C VeryTightSCF NormalPNO
formula: C21H30O2
InChI: InChI=1S/C21H30O2/c1-5-6-7-8-16-12-19(22)21(20(23)13-16)18-11-15(4)9-10-17(18)14(2)3/h11-13,17-18,22-23H,2,5-10H2,1,3-4H3
53 atoms
O  0.855511 -1.307043 1.686046
O  -0.107616 1.524872 -2.030688
C  2.580911 1.475699 -0.262088
C  1.886013 0.184804 -0.750684
C  3.226615 1.220861 1.108353
C  4.276037 0.1194 1.033801
C  2.709874 -1.05064 -0.48354
C  0.452434 0.103249 -0.243341
C  3.795983 -1.095802 0.28817
C  3.577984 2.07331 -1.235587
C  0.021477 -0.590275 0.893517
C  -0.527149 0.820659 -0.939078
C  4.618932 -2.339551 0.43938
C  3.849222 3.538362 -1.032454
C  -2.259571 0.139691 0.581236
C  -1.312835 -0.571302 1.293514
C  -1.855495 0.843096 -0.547956
C  -3.708894 0.111145 0.987494
C  4.180386 1.393389 -2.203803
C  -4.490344 -1.001175 0.285029
C  -5.955018 -1.053707 0.698673
C  -6.740897 -2.155159 -0.002924
C  -8.201933 -2.208337 0.423879
H  1.799145 2.226889 -0.123938
H  1.802559 0.264263 -1.836293
H  2.44064 0.93472 1.811998
H  3.67267 2.135568 1.501609
H  4.587173 -0.17404 2.040283
H  5.179058 0.489238 0.535325
H  2.393312 -1.953043 -1.000292
H  4.216046 -3.165578 -0.145336
H  4.670663 -2.648942 1.486138
H  5.645965 -2.157137 0.112732
H  4.599646 3.906936 -1.73014
H  2.932518 4.116133 -1.174401
H  4.199301 3.745085 -0.018554
H  -1.583756 -1.12875 2.181267
H  -2.576625 1.416968 -1.121795
H  -3.780556 -0.026754 2.06926
H  -4.173524 1.075405 0.763262
H  4.886497 1.878369 -2.866787
H  3.998466 0.340231 -2.37336
H  -4.011143 -1.961332 0.499285
H  -4.416957 -0.861749 -0.798219
H  -6.020782 -1.19708 1.7829
H  -6.426773 -0.086115 0.493657
H  1.723979 -1.370374 1.268945
H  -0.861171 1.954997 -2.433783
H  -6.264468 -3.119719 0.1971
H  -6.679432 -2.00704 -1.085457
H  -8.742736 -3.001441 -0.093905
H  -8.291235 -2.391327 1.496761
H  -8.708976 -1.265365 0.208416
totalener: -962.75997087 hartree
nucrepener: 1939.64789071 hartree
electener: -2902.40786158 hartree
oneelecener: -5164.60219836 hartree
twoeener: 2262.19433678 hartree
kineticenergy: 962.10717091 hartree
chargesum: 0.0000000
charge: -0.418106 -0.400208 0.215574 0.254423 -0.226766 -0.023381 -0.355109 -0.193049 -0.021455 -0.120506 0.335348 0.227932 -0.206552 -0.240821 0.162801 -0.300031 -0.239069 -0.099395 -0.162683 -0.080804 -0.076659 -0.023107 -0.193948 0.069694 0.096359 0.070430 0.073222 0.073135 0.067083 0.104919 0.072383 0.068616 0.073387 0.067888 0.068414 0.060507 0.083070 0.050457 0.070677 0.065516 0.062081 0.063818 0.050138 0.042136 0.033840 0.031152 0.243071 0.206510 0.030800 0.028434 0.061470 0.048787 0.047579
charge: 0.313838 0.317727 -0.037008 -0.050467 0.009753 -0.005317 -0.004775 -0.074467 -0.076490 -0.073358 -0.153409 -0.150096 0.026329 0.028563 -0.058252 -0.027854 -0.053121 -0.000908 0.008004 -0.014685 -0.025978 -0.033100 0.009593 0.034261 0.039310 0.021857 0.012129 0.020969 0.024462 0.013922 0.014484 0.013178 0.016191 0.012328 0.013559 0.009312 0.017261 0.006221 0.022209 0.019803 -0.006874 -0.002325 0.016099 0.013711 0.012425 0.011537 -0.144653 -0.115430 0.010013 0.009241 0.002671 0.003971 0.003637
qa: -0.4181 -0.4002 0.2156 0.2544 -0.2268 -0.0234 -0.3551 -0.1930 -0.0215 -0.1205 0.3353 0.2279 -0.2066 -0.2408 0.1628 -0.3000 -0.2391 -0.0994 -0.1627 -0.0808 -0.0767 -0.0231 -0.1939 0.0697 0.0964 0.0704 0.0732 0.0731 0.0671 0.1049 0.0724 0.0686 0.0734 0.0679 0.0684 0.0605 0.0831 0.0505 0.0707 0.0655 0.0621 0.0638 0.0501 0.0421 0.0338 0.0312 0.2431 0.2065 0.0308 0.0284 0.0615 0.0488 0.0476
va: 2.0176 2.0212 3.6390 3.6400 4.0282 3.8643 3.9107 3.6178 3.7518 3.7853 3.8659 3.8774 3.9670 4.0050 3.7141 4.0239 3.9407 3.8271 3.9139 3.8337 3.8646 3.8721 3.9652 1.0062 1.0172 1.0239 1.0013 1.0084 1.0154 1.0146 1.0039 0.9998 0.9983 1.0036 0.9986 0.9957 1.0293 1.0244 1.0126 1.0127 1.0173 1.0146 1.0250 1.0238 1.0166 1.0160 1.0360 1.0309 1.0142 1.0139 1.0066 1.0051 1.0049
e0: -962.759970869 hartree
corrType: DLPNO BASED
energy: -967.037056006787
dipole: -12.88662 12.88314 -0.00348 -3.68125 4.02947 0.34822 1.52825 -1.86336 -0.33511
magnitude: 0.48329 au
magnitude: 1.22843 debye
