program: Gaussian 09
title: 000034567
version: EM64L-G09RevD.01
frameworkgroup: C1[X(C15H16N2O2)]
method: RPBEPBE
basis: SDD
operation: Freq
keyword: #p
keyword: freq=noraman
keyword: PBEPBE/SDD
title: #p freq=noraman PBEPBE/SDD
converged: YES YES NO NO
title: Mulliken charges:
elementType: O O N N C C C C C C C C C C C C C C C H H H H H H H H H H H H H H H H
charge: -0.266390 -0.257039 -0.101250 -0.114939 0.367756 0.008008 -0.003150 0.269852 0.361148 -0.493462 -0.256356 -0.347855 -0.397040 -0.292931 -0.794484 -0.232131 -0.224423 -0.501934 -0.536315 0.278680 0.273590 0.242965 0.232997 0.255037 0.211792 0.239642 0.239175 0.226997 0.225692 0.235606 0.219822 0.233329 0.224739 0.224709 0.248165
chargesum: 0.00000
title: Mulliken charges with hydrogens summed into heavy atoms:
elementType: O O N N C C C C C C C C C C C C C C C
charge: -0.266390 -0.257039 -0.101250 -0.114939 0.367756 0.008008 -0.003150 0.269852 0.361148 -0.214782 0.017234 -0.104891 -0.164044 -0.037893 -0.103875 -0.005134 0.001268 0.186823 0.161298
polarizability: 4.23479217e+02 7.15545669e+00 2.06005682e+02 -2.02352777e-01 -4.57633364e-01 8.47912833e+01
1716.lowfreq: -8.0452 -6.5862 0.0003 0.0006 0.0007 4.5368 12.2906 42.7644 55.3080
frequency: 12.1194 42.7218 55.2518 57.3813 88.1997 110.1964 114.2967 166.0225 172.2755 177.9922 188.1087 218.5960 231.3481 236.0128 252.3211 283.4456 294.6090 351.0502 365.9371 373.0477 446.9903 451.1151 482.5788 505.2553 523.3539 543.9384 545.1973 605.7708 623.0198 642.8230 689.8777 720.8294 732.9309 746.4786 776.9360 809.9162 813.6644 862.8916 869.1941 874.8754 895.8307 956.8164 970.6670 979.5864 984.4493 988.6881 1011.2288 1039.1273 1045.7157 1090.6682 1110.5465 1113.3548 1116.0657 1142.4550 1153.6317 1165.6089 1167.6885 1185.1171 1199.9132 1226.4378 1240.7301 1266.9715 1278.6147 1338.2213 1379.4789 1389.5310 1398.3347 1423.5423 1426.4857 1432.7116 1447.2765 1449.8013 1454.6327 1458.2299 1468.2576 1468.8322 1472.3837 1474.8775 1476.1990 1548.3960 1580.2695 1600.3078 1620.4855 2967.1090 2988.5022 2991.8951 3058.3852 3073.2838 3088.5805 3099.0758 3117.8572 3122.1891 3129.2857 3133.6190 3152.9311 3154.5525 3171.9123 3172.6900 3186.7448
redmass: 3.8938 4.4733 3.0040 4.6541 3.7684 1.0792 4.0953 4.3907 3.2195 3.9866 3.1201 1.8758 4.4992 1.9517 1.3567 3.7518 3.2723 4.0232 3.7279 4.8456 7.6110 2.8959 3.1844 4.8614 6.1275 5.1506 3.6816 6.2256 4.3037 5.2871 6.8138 2.6050 2.2854 5.2322 1.6135 1.5343 4.9692 6.0904 1.6238 1.3286 7.6572 1.3829 1.3148 9.4980 1.5764 1.3297 2.7436 1.9746 1.5625 2.5205 1.2572 1.2437 1.7214 1.4282 1.4317 1.1206 2.0038 1.8607 2.4633 2.7024 3.9559 2.0527 1.6202 8.2219 6.5277 4.0821 1.2782 2.6685 2.1649 1.2960 1.0547 1.1629 1.3574 1.0469 1.0505 2.4969 1.4914 1.4474 1.2239 7.7983 6.7059 6.0170 6.7492 1.0325 1.0360 1.0282 1.1042 1.0968 1.1006 1.1043 1.1056 1.0856 1.1000 1.0903 1.0866 1.0960 1.0959 1.0960 1.0922
irintensity: 0.2857 0.7007 13.0810 1.0468 0.0044 0.8109 1.0383 0.5575 0.3759 0.4638 3.7184 1.1596 4.1351 3.1641 0.0789 0.0194 6.0317 0.7849 4.4262 0.0581 21.6959 1.7605 11.2011 8.0506 21.1223 31.3527 3.6517 8.8159 6.2931 8.7694 3.4034 8.1804 20.1601 0.3807 43.2782 37.7351 0.5073 1.4137 46.5867 0.5682 0.7957 0.8904 1.5130 7.5849 1.9227 0.0330 57.1737 11.2971 9.4396 39.9170 0.1821 0.2167 85.3571 3.7082 85.4465 8.1771 106.1776 45.4661 12.4436 201.2053 186.3994 179.1503 0.2349 81.1249 0.8799 64.1431 12.8425 15.3703 5.6725 11.6772 13.4362 27.6232 3.5664 12.6320 13.9708 2.9626 125.1330 34.7383 19.3056 149.7286 0.7780 1.9900 388.4962 88.2701 29.8905 43.3382 44.2420 15.7121 29.6971 30.4675 48.7702 6.2236 27.9245 19.8534 1.3783 42.4265 28.6315 11.2632 1.7755
temp: 298.150 k
press: 1.00000 atm
elementType: 8 8 7 7 6 6 6 6 6 6 6 6 6 6 6 6 6 6 6 1 1 1 1 1 1 1 1 1 1 1 1 1 1 1 1
symmnumber: 1
zpe: 725567.1 jmol-1
zpe.correction: 0.276354 hartree
zpe.thermalcorrener: 0.294714 hartree
zpe.thermalcorrenthalpy: 0.295658 hartree
zpe.thermalcorrgfe: 0.228273 hartree
zpe.sumelectzpe: -839.703793 hartree
zpe.sumelectthermal: -839.685433 hartree
zpe.sumelectthermalent: -839.684489 hartree
zpe.sumelectthermalfe: -839.751873 hartree
dipole: -0.2966 -1.8123 -0.0185
dipole: 1.8365
quadrupole: -93.0179 -96.3346 -116.5477
quadrupole: 14.8291 0.1662 -0.0571
quadrupole: 8.9489 5.6321 -14.5810 14.8291 0.1662 -0.0571
hfenergy: -839.9801468 hartree
pointgroup: C01 [X(C15H16N2O2)]
dipole: 0.1159576 0.2893551 0.6518293 debye
polarizability: 423.0471092|13.8763381|103.542606|2.0199644|43.3361733|187.6864664 unknown
InChI: InChI=1S/C15H16N2O2/c1-11-6-4-5-7-13(11)16-17-14-9-8-12(18-2)10-15(14)19-3/h4-10H,1-3H3
charge 0 multiplicity 1
35 atoms
O  1.82723 -1.18372 -2.676966
O  5.346138 0.180079 0.110693
N  -0.236537 -0.370328 -0.665755
N  -1.023979 0.01361 0.31526
C  -3.296222 0.243837 1.124017
C  1.150499 -0.211867 -0.420963
C  -2.422072 -0.143669 0.05672
C  2.093368 -0.622575 -1.433173
C  3.955407 0.081108 0.00468
C  3.48068 -0.467556 -1.20005
C  1.671629 0.341337 0.789911
C  3.040402 0.49462 1.020167
C  -4.692048 0.112031 0.925057
C  -2.959324 -0.643369 -1.165001
C  -2.748399 0.780294 2.43281
C  -5.222657 -0.384333 -0.287051
C  -4.349443 -0.763039 -1.336588
C  0.472425 -1.457808 -3.179952
C  5.902375 0.743093 1.345933
H  4.18552 -0.782547 -1.972843
H  0.937231 0.645704 1.542034
H  3.392901 0.924539 1.961661
H  -5.371443 0.404356 1.734424
H  -2.264022 -0.927496 -1.960207
H  -3.568849 1.019356 3.131501
H  -2.076412 0.048375 2.914879
H  -2.14756 1.692645 2.269409
H  -6.307468 -0.47441 -0.413169
H  -4.756999 -1.146995 -2.278606
H  -0.062935 -2.159502 -2.518855
H  0.647059 -1.903095 -4.172491
H  -0.116201 -0.528695 -3.261317
H  5.62695 0.131085 2.225946
H  5.569275 1.78769 1.496736
H  6.99238 0.718344 1.203253
