program: Orca
programVersion: 5.0.3
elementType: O O C C C C C C C C C C C C C C C C C C C C C H H H H H H H H H H H H H H H H H H H H H H H H H H H H H H
charge: 0
multiplicity: 1
keywords: wB97X-D3 TightOpt Freq def2-TZVPP def2/J RIJCOSX TIGHTSCF defgrid3
frequency: 0.00 0.00 0.00 0.00 0.00 0.00 13.52 25.95 39.95 42.95 47.18 65.42 70.33 92.06 102.78 134.27 136.82 165.23 169.95 175.87 182.54 206.36 222.22 241.03 243.16 254.67 288.95 311.20 319.51 329.64 338.66 354.28 367.56 400.10 406.65 443.90 465.75 482.31 502.95 536.66 541.59 567.25 579.49 597.39 616.69 626.61 642.11 703.41 728.62 735.56 751.69 765.34 775.31 784.23 818.89 850.68 855.99 868.00 892.48 894.84 916.12 933.92 938.98 946.64 970.47 979.49 980.88 1021.69 1027.09 1035.02 1041.95 1051.45 1066.21 1067.93 1070.28 1088.53 1091.35 1106.13 1122.96 1144.13 1156.01 1174.68 1192.14 1204.19 1211.52 1219.74 1227.65 1232.73 1264.45 1268.34 1270.57 1296.52 1311.66 1316.75 1335.21 1337.54 1339.66 1341.51 1351.07 1376.68 1386.10 1390.46 1393.77 1405.44 1411.62 1417.29 1422.57 1423.48 1424.09 1429.77 1456.88 1475.95 1485.48 1485.84 1492.15 1493.05 1496.02 1498.79 1499.73 1504.16 1506.16 1509.57 1512.57 1517.24 1573.07 1663.11 1710.99 1744.38 1758.03 3028.02 3040.49 3041.21 3045.40 3048.15 3050.59 3050.62 3054.40 3056.24 3062.54 3073.55 3075.36 3083.91 3086.98 3087.61 3105.09 3107.09 3108.40 3113.73 3121.69 3129.63 3144.93 3146.93 3155.45 3164.03 3170.42 3208.76 3247.84 3720.13 3918.30
frequency: 13.52 25.95 39.95 42.95 47.18 65.42 70.33 92.06 102.78 134.27 136.82 165.23 169.95 175.87 182.54 206.36 222.22 241.03 243.16 254.67 288.95 311.20 319.51 329.64 338.66 354.28 367.56 400.10 406.65 443.90 465.75 482.31 502.95 536.66 541.59 567.25 579.49 597.39 616.69 626.61 642.11 703.41 728.62 735.56 751.69 765.34 775.31 784.23 818.89 850.68 855.99 868.00 892.48 894.84 916.12 933.92 938.98 946.64 970.47 979.49 980.88 1021.69 1027.09 1035.02 1041.95 1051.45 1066.21 1067.93 1070.28 1088.53 1091.35 1106.13 1122.96 1144.13 1156.01 1174.68 1192.14 1204.19 1211.52 1219.74 1227.65 1232.73 1264.45 1268.34 1270.57 1296.52 1311.66 1316.75 1335.21 1337.54 1339.66 1341.51 1351.07 1376.68 1386.10 1390.46 1393.77 1405.44 1411.62 1417.29 1422.57 1423.48 1424.09 1429.77 1456.88 1475.95 1485.48 1485.84 1492.15 1493.05 1496.02 1498.79 1499.73 1504.16 1506.16 1509.57 1512.57 1517.24 1573.07 1663.11 1710.99 1744.38 1758.03 3028.02 3040.49 3041.21 3045.40 3048.15 3050.59 3050.62 3054.40 3056.24 3062.54 3073.55 3075.36 3083.91 3086.98 3087.61 3105.09 3107.09 3108.40 3113.73 3121.69 3129.63 3144.93 3146.93 3155.45 3164.03 3170.42 3208.76 3247.84 3720.13 3918.30
formula: C21H30O2
InChI: InChI=1S/C21H30O2/c1-5-6-7-8-16-12-19(22)21(20(23)13-16)18-11-15(4)9-10-17(18)14(2)3/h11-13,17-18,22-23H,2,5-10H2,1,3-4H3
53 atoms
O  0.855511 -1.307043 1.686046
O  -0.107616 1.524872 -2.030688
C  2.580911 1.475699 -0.262088
C  1.886013 0.184804 -0.750684
C  3.226615 1.220861 1.108353
C  4.276037 0.1194 1.033801
C  2.709874 -1.05064 -0.48354
C  0.452434 0.103249 -0.243341
C  3.795983 -1.095802 0.28817
C  3.577984 2.07331 -1.235587
C  0.021477 -0.590275 0.893517
C  -0.527149 0.820659 -0.939078
C  4.618932 -2.339551 0.43938
C  3.849222 3.538362 -1.032454
C  -2.259571 0.139691 0.581236
C  -1.312835 -0.571302 1.293514
C  -1.855495 0.843096 -0.547956
C  -3.708894 0.111145 0.987494
C  4.180386 1.393389 -2.203803
C  -4.490344 -1.001175 0.285029
C  -5.955018 -1.053707 0.698673
C  -6.740897 -2.155159 -0.002924
C  -8.201933 -2.208337 0.423879
H  1.799145 2.226889 -0.123938
H  1.802559 0.264263 -1.836293
H  2.44064 0.93472 1.811998
H  3.67267 2.135568 1.501609
H  4.587173 -0.17404 2.040283
H  5.179058 0.489238 0.535325
H  2.393312 -1.953043 -1.000292
H  4.216046 -3.165578 -0.145336
H  4.670663 -2.648942 1.486138
H  5.645965 -2.157137 0.112732
H  4.599646 3.906936 -1.73014
H  2.932518 4.116133 -1.174401
H  4.199301 3.745085 -0.018554
H  -1.583756 -1.12875 2.181267
H  -2.576625 1.416968 -1.121795
H  -3.780556 -0.026754 2.06926
H  -4.173524 1.075405 0.763262
H  4.886497 1.878369 -2.866787
H  3.998466 0.340231 -2.37336
H  -4.011143 -1.961332 0.499285
H  -4.416957 -0.861749 -0.798219
H  -6.020782 -1.19708 1.7829
H  -6.426773 -0.086115 0.493657
H  1.723979 -1.370374 1.268945
H  -0.861171 1.954997 -2.433783
H  -6.264468 -3.119719 0.1971
H  -6.679432 -2.00704 -1.085457
H  -8.742736 -3.001441 -0.093905
H  -8.291235 -2.391327 1.496761
H  -8.708976 -1.265365 0.208416
totalener: -968.83176597 hartree
nucrepener: 1947.28060360 hartree
electener: -2916.11236958 hartree
oneelecener: -5182.58826741 hartree
twoeener: 2266.47589783 hartree
kineticenergy: 964.38343260 hartree
xcener: -97.478516004036 hartree
chargesum: -0.0000000
charge: -0.327668 -0.297557 0.193012 0.199512 -0.265669 -0.045383 -0.368458 -0.226821 -0.050171 -0.125928 0.239747 0.188172 -0.216589 -0.246020 0.041680 -0.231023 -0.199451 -0.101796 -0.210444 -0.105071 -0.111538 -0.077747 -0.254697 0.070796 0.090367 0.095609 0.085794 0.084842 0.092102 0.119807 0.084207 0.089429 0.094142 0.079264 0.090490 0.083196 0.096703 0.067175 0.078629 0.076492 0.075595 0.092535 0.069189 0.061795 0.053544 0.051051 0.216110 0.168427 0.053605 0.051787 0.084373 0.071992 0.070860
charge: 0.353104 0.354315 -0.046374 -0.057765 0.000239 -0.015022 -0.010414 -0.073188 -0.090218 -0.086708 -0.188047 -0.184676 0.015032 0.016873 -0.077843 -0.021408 -0.046278 -0.013775 0.009854 -0.026749 -0.039042 -0.046950 -0.004793 0.041151 0.044395 0.027727 0.018087 0.027969 0.031544 0.019214 0.019412 0.019305 0.022539 0.017311 0.019844 0.015065 0.021991 0.011432 0.027434 0.025243 -0.002778 0.001260 0.022286 0.019880 0.018614 0.017744 -0.147164 -0.117839 0.016155 0.015403 0.008102 0.009419 0.009092
qa: -0.3277 -0.2976 0.1930 0.1995 -0.2657 -0.0454 -0.3685 -0.2268 -0.0502 -0.1259 0.2397 0.1882 -0.2166 -0.2460 0.0417 -0.2310 -0.1995 -0.1018 -0.2104 -0.1051 -0.1115 -0.0777 -0.2547 0.0708 0.0904 0.0956 0.0858 0.0848 0.0921 0.1198 0.0842 0.0894 0.0941 0.0793 0.0905 0.0832 0.0967 0.0672 0.0786 0.0765 0.0756 0.0925 0.0692 0.0618 0.0535 0.0511 0.2161 0.1684 0.0536 0.0518 0.0844 0.0720 0.0709
va: 2.1611 2.1569 3.6219 3.7403 4.0063 3.8464 3.9201 3.7323 3.7714 3.8249 3.9474 3.9542 3.9405 3.9575 3.8031 4.0550 3.9559 3.8349 3.9126 3.8329 3.8742 3.8867 3.9526 1.0121 1.0220 1.0239 1.0086 1.0103 1.0067 1.0124 1.0088 0.9993 0.9973 1.0094 0.9981 0.9997 1.0292 1.0259 1.0126 1.0112 1.0230 1.0125 1.0186 1.0179 1.0118 1.0115 1.0668 1.0598 1.0086 1.0083 1.0063 1.0034 1.0033
dispcorr: -0.026107834 hartree
energy: -968.860741722851
dipole: -12.88662 12.97587 0.08925 -3.68125 4.03272 0.35147 1.52825 -1.86736 -0.33912
magnitude: 0.49648 au
magnitude: 1.26196 debye
temp: 298.15 k
press: 1.00 atm
zeropoint: 0.47099221 hartree
thermalvibcorrection: 0.02148032 hartree
thermalrotcorrection: 0.00141627 hartree
thermaltrasncorrection: 0.00141627 hartree
thermaltotal: -968.36543664 hartree
thermalcorr: 0.02431287 hartree
nonthermalcorr: 0.47099221 hartree
totalcorr: 0.49530508 hartree
thermalcorrenthalpy: 0.00094421 hartree
totalenthalpy: -968.36449243 hartree
totalentropycorr: -0.07573013 hartree
gibbsenthalpy: -968.44022256 hartree
gibbsminuselec: 0.42051916 hartree
