program: Orca
programVersion: 5.0.3
elementType: O O C C C C C C C C C C C C C C C C C C C C C H H H H H H H H H H H H H H H H H H H H H H H H H H H H H H
charge: 0
multiplicity: 1
keywords: DLPNO-CCSD(T) def2-TZVPP def2-TZVPP/C VeryTightSCF NormalPNO
formula: C21H30O2
InChI: InChI=1S/C21H30O2/c1-5-6-7-8-15-12-18(22)20-16-11-14(2)9-10-17(16)21(3,4)23-19(20)13-15/h12-13,16-17,22H,2,5-11H2,1,3-4H3
53 atoms
O  -0.760277 2.008492 -0.517628
O  0.33787 -2.594524 0.038303
C  -2.641706 0.585481 -0.143631
C  -1.760458 -0.653394 0.062061
C  -1.930922 1.863628 0.308633
C  -4.025603 0.35034 0.455154
C  -2.407574 -1.825111 -0.700754
C  -0.329887 -0.35807 -0.329782
C  -4.699523 -0.85153 -0.213622
C  -3.806365 -2.061014 -0.197347
C  0.074277 0.946066 -0.627942
C  -1.505065 1.845817 1.77385
C  -2.745846 3.110574 0.006896
C  0.666942 -1.33573 -0.372252
C  1.365316 1.240435 -1.053252
C  2.317061 0.241393 -1.150714
C  -4.205399 -3.238841 0.26471
C  1.958826 -1.051724 -0.790982
C  3.728559 0.564999 -1.570834
C  4.484783 1.416557 -0.541736
C  4.574214 0.803082 0.853248
C  5.372962 -0.493675 0.926587
C  5.454101 -1.050528 2.341801
H  -2.770032 0.711632 -1.226872
H  -1.778315 -0.922275 1.125847
H  -4.656491 1.231511 0.329379
H  -3.939388 0.166102 1.530312
H  -1.817452 -2.730307 -0.600218
H  -2.435424 -1.566027 -1.765509
H  -4.915972 -0.588149 -1.25545
H  -5.654182 -1.074677 0.264508
H  -2.373164 1.737464 2.424663
H  -1.005168 2.781959 2.022347
H  -0.81596 1.028881 1.985058
H  -3.103979 3.097999 -1.023093
H  -2.120513 3.992932 0.140732
H  -3.601058 3.193747 0.676209
H  1.603543 2.270994 -1.283906
H  -3.540388 -4.093978 0.277781
H  -5.210822 -3.388058 0.64071
H  2.694611 -1.849117 -0.825413
H  4.271216 -0.363473 -1.759058
H  3.706112 1.104378 -2.520702
H  1.11283 -3.152897 -0.021171
H  3.994797 2.390635 -0.466225
H  5.492429 1.609214 -0.922697
H  5.028552 1.534537 1.528477
H  3.563605 0.625884 1.235006
H  6.381868 -0.320158 0.538572
H  4.922222 -1.244969 0.272508
H  6.030495 -1.975905 2.378469
H  5.928066 -0.336862 3.01899
H  4.457263 -1.262656 2.734327
totalener: -962.77812897 hartree
nucrepener: 2032.99672960 hartree
electener: -2995.77485857 hartree
oneelecener: -5351.17406648 hartree
twoeener: 2355.39920791 hartree
kineticenergy: 962.13408687 hartree
chargesum: -0.0000000
charge: -0.411763 -0.403389 -0.096349 0.214367 0.592734 -0.192560 -0.187432 -0.210641 -0.111323 -0.029761 0.357260 -0.325735 -0.260623 0.189580 -0.326431 0.105505 -0.156242 -0.203310 -0.147761 -0.076253 -0.090512 -0.036439 -0.195846 0.070557 0.065765 0.064141 0.058178 0.083792 0.070614 0.059299 0.063594 0.068507 0.079648 0.079650 0.073487 0.079486 0.055590 0.082911 0.058391 0.056857 0.047364 0.066198 0.085348 0.209461 0.055272 0.051115 0.057199 0.048672 0.035082 0.015223 0.059399 0.050692 0.051430
charge: 0.256798 0.320429 -0.052351 -0.040556 -0.213603 0.006004 0.017828 -0.069606 0.000685 -0.078970 -0.157681 0.040058 0.032747 -0.147385 -0.024071 -0.058434 0.005127 -0.051559 0.001123 -0.012042 -0.022063 -0.033774 0.010490 0.037107 0.031274 0.014066 0.016492 0.017484 0.022267 0.021516 0.018652 0.011576 0.014378 0.014268 0.013898 0.014503 0.009486 0.017766 -0.003919 -0.005693 0.004529 0.017017 0.022133 -0.115663 0.013380 0.011957 0.012223 0.016414 0.008984 0.003995 0.001644 0.004278 0.004794
qa: -0.4118 -0.4034 -0.0963 0.2144 0.5927 -0.1926 -0.1874 -0.2106 -0.1113 -0.0298 0.3573 -0.3257 -0.2606 0.1896 -0.3264 0.1055 -0.1562 -0.2033 -0.1478 -0.0763 -0.0905 -0.0364 -0.1958 0.0706 0.0658 0.0641 0.0582 0.0838 0.0706 0.0593 0.0636 0.0685 0.0796 0.0796 0.0735 0.0795 0.0556 0.0829 0.0584 0.0569 0.0474 0.0662 0.0853 0.2095 0.0553 0.0511 0.0572 0.0487 0.0351 0.0152 0.0594 0.0507 0.0514
va: 1.9653 2.0231 4.0221 3.6726 3.4980 3.9099 3.9294 3.5547 3.9672 3.5972 3.8757 4.0204 3.9258 3.8772 4.0889 3.7530 3.9619 3.8681 3.8791 3.8801 3.9016 3.8608 3.9636 1.0212 1.0141 1.0099 1.0168 1.0399 1.0108 1.0126 1.0157 1.0056 1.0112 0.9996 1.0092 1.0156 1.0035 1.0291 1.0176 1.0155 1.0189 1.0027 1.0068 1.0285 1.0126 1.0159 1.0087 1.0139 1.0150 1.0123 1.0054 1.0061 1.0053
e0: -962.778128968 hartree
corrType: DLPNO BASED
energy: -967.059188215241
dipole: 8.67695 -8.42876 0.24819 2.99044 -3.02941 -0.03897 9.44854 -9.22887 0.21966
magnitude: 0.33372 au
magnitude: 0.84825 debye
