program: Orca
programVersion: 5.0.3
elementType: O O C C C C C C C C C C C C C C C C C C C C C H H H H H H H H H H H H H H H H H H H H H H H H H H H H H H
charge: 0
multiplicity: 1
keywords: wB97X-D3 TightOpt Freq def2-TZVPP def2/J RIJCOSX TIGHTSCF defgrid3
frequency: 0.00 0.00 0.00 0.00 0.00 0.00 12.94 27.30 42.23 68.68 69.65 94.21 97.74 108.02 126.74 178.00 180.10 194.72 209.16 224.24 240.86 247.84 257.70 260.75 274.75 284.41 291.47 328.46 329.88 349.83 380.90 384.85 392.98 425.74 444.00 458.96 488.27 500.57 507.85 523.55 560.78 566.12 625.32 643.36 659.14 687.57 697.33 737.92 742.26 765.73 779.85 800.64 808.56 825.49 850.22 887.31 891.70 897.57 907.47 922.83 943.16 950.21 951.93 970.45 984.17 988.70 999.99 1014.39 1027.45 1030.56 1044.76 1059.10 1076.70 1081.08 1106.77 1115.21 1121.86 1139.21 1140.17 1154.65 1175.70 1183.87 1196.34 1215.42 1228.01 1232.34 1255.39 1271.44 1273.49 1285.88 1297.32 1304.25 1312.13 1321.52 1324.60 1330.64 1337.55 1346.07 1352.78 1367.40 1371.84 1376.83 1389.45 1398.96 1410.14 1415.19 1417.41 1420.38 1425.75 1429.42 1462.91 1483.96 1487.94 1489.80 1493.90 1495.24 1496.91 1500.55 1503.54 1505.99 1506.94 1511.05 1512.28 1513.79 1516.69 1554.85 1654.83 1713.04 1751.52 2980.31 3022.66 3030.95 3036.81 3043.48 3044.47 3053.06 3053.79 3055.96 3056.20 3067.23 3068.94 3071.32 3082.19 3088.03 3108.07 3111.90 3115.12 3124.22 3132.18 3133.28 3146.15 3148.33 3153.30 3154.49 3157.20 3207.87 3209.18 3239.49 3918.58
frequency: 12.94 27.30 42.23 68.68 69.65 94.21 97.74 108.02 126.74 178.00 180.10 194.72 209.16 224.24 240.86 247.84 257.70 260.75 274.75 284.41 291.47 328.46 329.88 349.83 380.90 384.85 392.98 425.74 444.00 458.96 488.27 500.57 507.85 523.55 560.78 566.12 625.32 643.36 659.14 687.57 697.33 737.92 742.26 765.73 779.85 800.64 808.56 825.49 850.22 887.31 891.70 897.57 907.47 922.83 943.16 950.21 951.93 970.45 984.17 988.70 999.99 1014.39 1027.45 1030.56 1044.76 1059.10 1076.70 1081.08 1106.77 1115.21 1121.86 1139.21 1140.17 1154.65 1175.70 1183.87 1196.34 1215.42 1228.01 1232.34 1255.39 1271.44 1273.49 1285.88 1297.32 1304.25 1312.13 1321.52 1324.60 1330.64 1337.55 1346.07 1352.78 1367.40 1371.84 1376.83 1389.45 1398.96 1410.14 1415.19 1417.41 1420.38 1425.75 1429.42 1462.91 1483.96 1487.94 1489.80 1493.90 1495.24 1496.91 1500.55 1503.54 1505.99 1506.94 1511.05 1512.28 1513.79 1516.69 1554.85 1654.83 1713.04 1751.52 2980.31 3022.66 3030.95 3036.81 3043.48 3044.47 3053.06 3053.79 3055.96 3056.20 3067.23 3068.94 3071.32 3082.19 3088.03 3108.07 3111.90 3115.12 3124.22 3132.18 3133.28 3146.15 3148.33 3153.30 3154.49 3157.20 3207.87 3209.18 3239.49 3918.58
formula: C21H30O2
InChI: InChI=1S/C21H30O2/c1-5-6-7-8-15-12-18(22)20-16-11-14(2)9-10-17(16)21(3,4)23-19(20)13-15/h12-13,16-17,22H,2,5-11H2,1,3-4H3
53 atoms
O  -0.825486 0.731128 -1.952507
O  -0.018519 -1.31201 2.328188
C  -2.827906 0.203467 -0.769787
C  -2.057126 -0.324974 0.447337
C  -2.056595 1.313642 -1.488112
C  -4.264608 0.527794 -0.370196
C  -2.717597 -1.6622 0.849269
C  -0.577058 -0.415232 0.15533
C  -4.969284 -0.728536 0.154036
C  -4.159258 -1.426571 1.212333
C  -0.059228 0.068086 -1.047844
C  -1.74477 2.517318 -0.603623
C  -2.755411 1.757496 -2.762817
C  0.344865 -0.946226 1.065294
C  1.277173 -0.100843 -1.387955
C  2.150273 -0.716408 -0.506511
C  -4.660648 -1.773503 2.390498
C  1.678461 -1.119261 0.736334
C  3.609574 -0.859398 -0.849446
C  4.436541 0.3456 -0.396035
C  5.915918 0.206175 -0.735801
C  6.761267 1.42526 -0.371794
C  6.837682 1.704273 1.125126
H  -2.866048 -0.614935 -1.50011
H  -2.218222 0.380727 1.27642
H  -4.823733 0.922834 -1.219395
H  -4.269742 1.29987 0.40507
H  -2.204983 -2.163057 1.668985
H  -2.649689 -2.338567 -0.009046
H  -5.109183 -1.418369 -0.686097
H  -5.961869 -0.484541 0.534211
H  -1.138752 2.241025 0.258633
H  -2.665808 2.976859 -0.243455
H  -1.193039 3.261547 -1.177499
H  -3.649318 2.338895 -2.54054
H  -3.036169 0.895986 -3.369641
H  -2.079331 2.380752 -3.347361
H  1.615862 0.274565 -2.345381
H  -4.057072 -2.277835 3.136001
H  -5.694842 -1.575689 2.645794
H  2.341119 -1.55524 1.473371
H  4.007169 -1.764578 -0.382825
H  3.720541 -0.987945 -1.929243
H  -0.894842 -0.982364 2.524158
H  4.30338 0.475283 0.681181
H  4.034938 1.250407 -0.863884
H  6.320765 -0.677835 -0.230244
H  6.014774 0.01317 -1.808628
H  6.362798 2.304637 -0.887576
H  7.772767 1.279765 -0.759923
H  7.503666 2.541906 1.336127
H  5.860726 1.951535 1.54254
H  7.217547 0.834338 1.66594
totalener: -968.84972350 hartree
nucrepener: 1990.59443695 hartree
electener: -2959.44416044 hartree
oneelecener: -5268.56084109 hartree
twoeener: 2309.11668064 hartree
kineticenergy: 964.30066106 hartree
xcener: -97.502579516486 hartree
chargesum: -0.0000000
charge: -0.313529 -0.298004 -0.109626 0.102471 0.431046 -0.202918 -0.253006 -0.224771 -0.138883 -0.016547 0.201100 -0.348078 -0.295737 0.167094 -0.251278 0.081295 -0.183225 -0.206765 -0.114193 -0.122210 -0.117511 -0.101952 -0.256959 0.077368 0.086365 0.082680 0.079746 0.086800 0.102552 0.086820 0.071626 0.102492 0.090830 0.101262 0.077250 0.099647 0.101372 0.098034 0.080646 0.080012 0.099478 0.081001 0.078853 0.191511 0.071006 0.068647 0.058433 0.064578 0.051738 0.066922 0.084856 0.075514 0.074148
charge: 0.307478 0.355791 -0.061305 -0.060519 -0.243969 -0.003446 0.004051 -0.083121 -0.007583 -0.092798 -0.191824 0.028423 0.019888 -0.183172 -0.019417 -0.074793 0.010798 -0.022305 -0.013071 -0.026513 -0.037927 -0.046170 -0.004135 0.044494 0.032556 0.021097 0.022417 0.020712 0.034159 0.030098 0.025318 0.019681 0.017067 0.021215 0.015180 0.019393 0.020721 0.021492 -0.000393 0.000146 0.021918 0.027045 0.026461 -0.127971 0.018933 0.021372 0.018314 0.018432 0.015713 0.015038 0.008194 0.006842 0.009992
qa: -0.3135 -0.2980 -0.1096 0.1025 0.4310 -0.2029 -0.2530 -0.2248 -0.1389 -0.0165 0.2011 -0.3481 -0.2957 0.1671 -0.2513 0.0813 -0.1832 -0.2068 -0.1142 -0.1222 -0.1175 -0.1020 -0.2570 0.0774 0.0864 0.0827 0.0797 0.0868 0.1026 0.0868 0.0716 0.1025 0.0908 0.1013 0.0773 0.0996 0.1014 0.0980 0.0806 0.0800 0.0995 0.0810 0.0789 0.1915 0.0710 0.0686 0.0584 0.0646 0.0517 0.0669 0.0849 0.0755 0.0741
va: 2.1388 2.1885 3.9733 3.7073 3.6874 3.8959 3.9379 3.4475 3.9883 3.6063 4.0051 3.9798 3.9145 4.0246 4.1042 3.7410 3.9457 4.0122 3.8485 3.8280 3.8825 3.9026 3.9346 1.0241 1.0047 1.0136 1.0093 1.0476 1.0113 1.0029 1.0198 0.9989 1.0051 1.0127 1.0030 1.0074 1.0165 1.0289 1.0173 1.0187 1.0267 1.0097 1.0126 1.0472 1.0145 1.0149 1.0110 1.0140 1.0102 1.0080 1.0065 1.0019 1.0025
dispcorr: -0.026562320 hartree
energy: -968.879694941810
dipole: 11.67479 -12.50911 -0.83431 9.97106 -9.43891 0.53215 -0.65915 0.55400 -0.10515
magnitude: 0.99515 au
magnitude: 2.52946 debye
temp: 298.15 k
press: 1.00 atm
zeropoint: 0.47341011 hartree
thermalvibcorrection: 0.01999229 hartree
thermalrotcorrection: 0.00141627 hartree
thermaltrasncorrection: 0.00141627 hartree
thermaltotal: -968.38346000 hartree
thermalcorr: 0.02282484 hartree
nonthermalcorr: 0.47341011 hartree
totalcorr: 0.49623494 hartree
thermalcorrenthalpy: 0.00094421 hartree
totalenthalpy: -968.38251579 hartree
totalentropycorr: -0.07233141 hartree
gibbsenthalpy: -968.45484720 hartree
gibbsminuselec: 0.42484774 hartree
