program: Gaussian 09
title: 000034584
version: EM64L-G09RevD.01
frameworkgroup: C1[X(C15H20N2O2)]
method: RPBEPBE
basis: SDD
operation: Freq
keyword: #p
keyword: freq=noraman
keyword: PBEPBE/SDD
title: #p freq=noraman PBEPBE/SDD
converged: YES YES NO NO
title: Mulliken charges:
elementType: O O N N C C C C C C C C C C C C C C C H H H H H H H H H H H H H H H H H H H H
charge: -0.343263 -0.267117 0.001609 -0.469638 -0.179359 0.005841 -0.460653 -0.461956 -0.488551 -0.447387 -0.444738 0.234376 0.314247 0.272929 -0.348887 -0.383287 -0.844791 -0.233582 -0.250965 0.232961 0.257243 0.209194 0.229319 0.216338 0.212876 0.251842 0.236635 0.230671 0.226395 0.227615 0.229260 0.350306 0.298821 0.227291 0.244021 0.229886 0.230887 0.226989 0.226623
chargesum: 0.00000
title: Mulliken charges with hydrogens summed into heavy atoms:
elementType: O O N N C C C C C C C C C C C C C C C
charge: -0.343263 -0.267117 0.001609 -0.119332 0.053602 0.263085 -0.022140 -0.032742 -0.000073 0.009679 0.012137 0.234376 0.314247 0.272929 -0.050066 -0.155996 -0.139998 -0.006594 -0.024342
polarizability: 2.56758710e+02 -1.72884223e+00 1.75560091e+02 9.06788409e+00 1.38545070e-01 1.13621927e+02
1716.lowfreq: -19.7260 -8.4983 -0.0008 -0.0005 -0.0003 3.4960 20.0724 20.2817 46.6507
frequency: 14.8328 19.6403 46.3883 62.8412 71.3014 97.9309 151.6476 176.1016 188.0406 190.8186 236.2403 270.8506 286.3777 289.6630 326.4203 391.6280 406.7454 417.5263 443.9483 457.0427 526.9231 537.8102 539.2391 571.9220 592.8412 609.2566 642.0429 696.6200 700.2676 726.9150 741.2474 765.4633 771.9791 789.2660 803.6696 810.1691 832.9594 856.7862 870.5028 878.8750 906.6889 936.7150 950.9959 954.0758 977.8969 982.2293 991.6220 991.9699 1006.9383 1020.8890 1042.2799 1048.7458 1053.4076 1074.4212 1099.5193 1114.1125 1130.0425 1158.6304 1170.9228 1174.4908 1198.3931 1199.9610 1214.9963 1230.6896 1271.2821 1272.3985 1298.4754 1298.8529 1303.1741 1303.5860 1307.8079 1312.0363 1318.0365 1326.5597 1348.3334 1363.6466 1378.9606 1397.8112 1441.8926 1442.2768 1455.6310 1457.7663 1465.9862 1467.6295 1479.8448 1480.6761 1489.8222 1521.1485 1598.2217 1619.3228 1660.1481 2954.8214 2982.5485 2991.3357 3001.5903 3004.5260 3009.2430 3023.4935 3024.9568 3038.1455 3046.4574 3049.4587 3066.8051 3075.2671 3079.7378 3088.0656 3121.4616 3137.2395 3160.6521 3186.7883 3552.8180
redmass: 3.5865 4.0367 3.6358 5.5816 4.1699 3.6801 3.0234 3.4609 4.5533 1.0748 3.3601 2.2837 3.8666 4.1655 3.1679 2.5359 2.2488 3.0606 2.9771 4.3861 4.9108 4.1943 3.2798 4.2218 5.2482 6.2946 1.3147 6.5618 6.6122 2.9094 4.0722 1.3301 2.9720 1.8591 2.2150 1.9044 2.3342 3.5367 3.0430 1.3032 3.6683 1.9599 1.3669 3.9624 2.2891 2.0524 2.4946 1.3503 3.7980 2.8536 1.5229 2.1224 2.7552 2.4605 1.6724 1.9205 1.3688 2.3410 1.4052 1.1031 1.5669 1.6414 1.3642 1.2935 1.9919 1.4928 1.3172 1.3085 1.5492 1.3630 1.3912 1.3850 1.3209 1.3217 1.3643 1.5025 4.9473 1.2843 2.1924 1.0868 1.8417 1.0874 1.0878 1.0825 1.0931 1.0459 1.3788 2.1380 5.6390 5.8708 8.3664 1.0399 1.0596 1.0596 1.0606 1.0623 1.0620 1.0978 1.0866 1.1032 1.0902 1.1007 1.1057 1.1050 1.1046 1.0949 1.0873 1.0899 1.0980 1.0953 1.0753
irintensity: 0.2190 0.2310 0.2987 2.2903 1.6105 1.2108 1.1538 0.7046 1.2707 1.0078 5.1373 1.6031 4.9591 8.2803 9.2947 1.0730 1.3682 0.1374 8.1854 1.5663 3.3843 2.2981 4.3743 7.2282 2.3381 4.3778 41.3031 29.3113 13.2151 0.5562 15.6843 97.9618 5.7646 6.6285 15.3058 2.8318 22.5483 0.0132 1.3129 2.7489 4.6163 7.8488 3.4565 6.7433 132.4863 14.7310 44.3590 4.4716 237.5655 6.6456 6.8705 10.5454 47.9828 48.5244 0.2478 25.7509 14.1070 320.7860 70.0550 1.1412 7.4650 19.2194 4.8983 1.3290 15.6431 3.4526 1.5793 8.3360 41.0622 5.1016 0.7703 2.2648 0.4381 0.7123 6.3407 29.8686 50.3317 20.4290 38.6253 9.0334 197.2015 0.6802 13.0092 18.2410 14.3874 14.4200 36.2826 462.1744 103.3440 15.9305 209.5939 31.5816 33.8905 26.0182 94.0679 80.7541 22.8476 22.2958 6.9570 9.1156 31.4578 6.5466 23.7828 84.5132 40.3447 17.9520 9.3727 18.6512 28.1755 8.0709 32.2519
temp: 298.150 k
press: 1.00000 atm
elementType: 8 8 7 7 6 6 6 6 6 6 6 6 6 6 6 6 6 6 6 1 1 1 1 1 1 1 1 1 1 1 1 1 1 1 1 1 1 1 1
symmnumber: 1
zpe: 862017.7 jmol-1
zpe.correction: 0.328325 hartree
zpe.thermalcorrener: 0.345462 hartree
zpe.thermalcorrenthalpy: 0.346406 hartree
zpe.thermalcorrgfe: 0.281022 hartree
zpe.sumelectzpe: -842.127747 hartree
zpe.sumelectthermal: -842.110610 hartree
zpe.sumelectthermalent: -842.109666 hartree
zpe.sumelectthermalfe: -842.175049 hartree
dipole: -0.5567 3.2174 -1.2092
dipole: 3.4819
quadrupole: -101.5567 -108.9865 -118.8618
quadrupole: 2.4024 7.4038 1.4945
quadrupole: 8.2449 0.8151 -9.0601 2.4024 7.4038 1.4945
hfenergy: -842.4560718 hartree
pointgroup: C01 [X(C15H20N2O2)]
dipole: 0.2122511 1.3527696 -0.0395969 debye
polarizability: 256.9708941|4.9837673|166.7461272|5.1765009|-21.7552069|122.2237062 unknown
InChI: InChI=1S/C15H20N2O2/c1-11-4-2-3-5-13(11)16-15(18)19-14-10-17-8-6-12(14)7-9-17/h2-5,12,14,16H,6-10H2,1H3
charge 0 multiplicity 1
39 atoms
O  0.863634 0.43531 0.271443
O  -0.248816 -1.535203 0.935319
N  3.965343 -0.815774 -1.038288
N  -1.385691 0.37958 0.100888
C  3.209994 0.916295 0.753072
C  2.16433 -0.209859 0.629187
C  3.404308 1.620968 -0.617256
C  4.549406 0.252229 1.185101
C  2.639505 -1.209742 -0.481898
C  3.859514 0.5391 -1.664555
C  4.972613 -0.773027 0.065787
C  -0.279373 -0.364136 0.480077
C  -2.756967 -0.00222 0.135739
C  -3.717604 0.957424 -0.315232
C  -3.172454 -1.27857 0.595993
C  -5.084384 0.597687 -0.287897
C  -3.288298 2.328031 -0.81346
C  -4.544813 -1.603954 0.608826
C  -5.509051 -0.670827 0.168522
H  2.877569 1.64321 1.514921
H  2.01688 -0.72704 1.59501
H  4.16423 2.417958 -0.510677
H  2.459802 2.102087 -0.92589
H  4.427977 -0.254053 2.162103
H  5.31597 1.03827 1.318468
H  2.708092 -2.234819 -0.079614
H  1.903543 -1.220208 -1.306278
H  3.139747 0.466443 -2.499713
H  4.845717 0.787592 -2.096529
H  5.947501 -0.499875 -0.37623
H  5.069167 -1.794125 0.477269
H  -1.165708 1.318606 -0.23545
H  -2.421558 -1.994691 0.935901
H  -5.826607 1.328235 -0.631846
H  -4.166334 2.923929 -1.111717
H  -2.753215 2.909153 -0.035059
H  -2.625341 2.262185 -1.699897
H  -4.856167 -2.59186 0.965839
H  -6.57456 -0.923509 0.179022
