program: Orca
programVersion: 5.0.3
elementType: O O C C C C C C C C C C C C C C C C C C C C C H H H H H H H H H H H H H H H H H H H H H H H H H H H H H H
charge: 0
multiplicity: 1
keywords: DLPNO-CCSD(T) def2-TZVPP def2-TZVPP/C VeryTightSCF
formula: C21H30O2
InChI: InChI=1S/C21H30O2/c1-5-6-7-8-15-12-18(22)20-16-11-14(2)9-10-17(16)21(3,4)23-19(20)13-15/h11-13,16-17,22H,5-10H2,1-4H3
53 atoms
O  -1.161678 1.993099 -0.850368
O  0.214337 -2.122316 1.236087
C  -2.974448 0.534961 -0.294282
C  -2.043337 -0.460221 0.412714
C  -2.441247 1.967147 -0.193456
C  -4.418161 0.33252 0.173993
C  -0.597238 -0.134646 0.141534
C  -4.726103 -1.122631 0.606549
C  -2.488548 -1.83539 -0.033339
C  -3.77976 -2.146057 0.031538
C  -0.240388 1.060321 -0.488796
C  -3.296693 2.932977 -0.996186
C  -2.263323 2.466603 1.238064
C  0.44278 -0.977931 0.533715
C  1.081028 1.355914 -0.784224
C  -4.342789 -3.456358 -0.421471
C  2.097325 0.475876 -0.433555
C  1.769044 -0.690131 0.241599
C  3.523158 0.831903 -0.790537
C  4.60739 -0.105965 -0.279275
C  6.005162 0.363403 -0.669277
C  7.123419 -0.598077 -0.271576
C  7.276571 -0.787077 1.233549
H  -2.922358 0.289101 -1.359214
H  -2.22493 -0.371651 1.495668
H  -5.096789 0.622508 -0.628566
H  -4.637953 0.994345 1.014308
H  -5.756333 -1.375462 0.351897
H  -4.667612 -1.188322 1.69794
H  -1.771061 -2.519094 -0.475664
H  -4.278147 3.056068 -0.538301
H  -2.811622 3.907927 -1.038914
H  -3.427559 2.570533 -2.016198
H  -3.213421 2.481889 1.772165
H  -1.564887 1.845257 1.798089
H  -1.867595 3.481823 1.220219
H  1.299616 2.292942 -1.280946
H  -5.072763 -3.307762 -1.221214
H  -4.867561 -3.957611 0.395955
H  -3.563079 -4.123685 -0.78683
H  2.521759 -1.395234 0.564324
H  3.593878 0.897524 -1.881155
H  3.72454 1.843181 -0.423498
H  4.44501 -1.112934 -0.677337
H  4.532107 -0.187465 0.808245
H  -0.726653 -2.25617 1.359844
H  6.037854 0.515827 -1.752627
H  6.195432 1.344427 -0.219656
H  8.066447 -0.228729 -0.682894
H  6.946528 -1.568937 -0.745122
H  8.130898 -1.424306 1.465315
H  7.432182 0.171396 1.734283
H  6.394492 -1.251302 1.676628
totalener: -962.77174671 hartree
nucrepener: 1975.13162147 hartree
electener: -2937.90336818 hartree
oneelecener: -5235.24258168 hartree
twoeener: 2297.33921350 hartree
kineticenergy: 962.12242021 hartree
chargesum: -0.0000000
charge: -0.412325 -0.390793 -0.013358 0.182109 0.524703 -0.290078 -0.144128 -0.062636 -0.318865 -0.005385 0.272760 -0.248281 -0.318870 0.134996 -0.314501 -0.202373 0.166735 -0.186632 -0.119303 -0.050750 -0.068351 -0.058108 -0.198331 0.081461 0.077428 0.071383 0.070637 0.079773 0.069550 0.116226 0.057221 0.078796 0.072315 0.064373 0.079707 0.081358 0.083569 0.065691 0.068714 0.071444 0.080138 0.060584 0.059717 0.039264 0.044754 0.226952 0.045190 0.034914 0.047560 0.028300 0.062706 0.049302 0.052741
charge: 0.254116 0.319049 -0.044947 -0.065334 -0.216497 0.012687 -0.083743 0.008290 -0.023036 -0.074901 -0.160415 0.035429 0.038658 -0.150954 -0.028621 0.024559 -0.050299 -0.030863 -0.001119 -0.021159 -0.023363 -0.032401 0.009983 0.037822 0.031782 0.013754 0.013539 0.017523 0.021167 0.013650 0.011719 0.014502 0.014562 0.007708 0.014196 0.015567 0.016911 0.013229 0.013906 0.015150 0.015143 0.023762 0.023877 0.014976 0.013342 -0.124890 0.012599 0.012018 0.008983 0.009506 0.002671 0.004499 0.001708
qa: -0.4123 -0.3908 -0.0134 0.1821 0.5247 -0.2901 -0.1441 -0.0626 -0.3189 -0.0054 0.2728 -0.2483 -0.3189 0.1350 -0.3145 -0.2024 0.1667 -0.1866 -0.1193 -0.0508 -0.0684 -0.0581 -0.1983 0.0815 0.0774 0.0714 0.0706 0.0798 0.0695 0.1162 0.0572 0.0788 0.0723 0.0644 0.0797 0.0814 0.0836 0.0657 0.0687 0.0714 0.0801 0.0606 0.0597 0.0393 0.0448 0.2270 0.0452 0.0349 0.0476 0.0283 0.0627 0.0493 0.0527
va: 1.9649 2.0525 3.9127 3.7869 3.6217 3.9565 3.3436 3.8723 3.7559 3.7167 3.9798 3.9245 4.0102 4.0932 4.1006 3.9713 3.7399 3.8490 3.8584 3.8574 3.8822 3.8867 3.9553 1.0281 1.0076 1.0139 1.0074 1.0043 1.0178 1.0197 1.0053 1.0150 1.0109 1.0067 1.0004 1.0125 1.0282 0.9991 0.9977 1.0051 1.0301 1.0058 1.0057 1.0143 1.0144 1.0195 1.0146 1.0155 1.0105 1.0160 1.0062 1.0058 1.0014
e0: -962.771746714 hartree
corrType: DLPNO BASED
energy: -967.051641332667
dipole: 10.20589 -11.38431 -1.17842 0.21470 -0.18402 0.03068 1.95416 -1.79499 0.15916
magnitude: 1.18952 au
magnitude: 3.02352 debye
