program: Orca
programVersion: 5.0.3
elementType: O O C C C C C C C C C C C C C C C C C C C C C H H H H H H H H H H H H H H H H H H H H H H H H H H H H H H
charge: 0
multiplicity: 1
keywords: wB97X-D3 TightOpt Freq def2-TZVPP def2/J RIJCOSX TIGHTSCF defgrid3
frequency: 0.00 0.00 0.00 0.00 0.00 0.00 16.05 24.28 51.66 66.46 67.70 90.65 108.73 124.63 147.68 157.13 175.71 183.39 203.35 213.94 234.57 237.37 245.65 250.79 261.33 275.63 291.93 303.71 327.97 329.79 359.73 380.03 385.35 403.01 420.85 439.96 459.40 487.77 501.01 512.82 525.48 555.90 582.76 605.34 636.90 649.23 674.86 695.66 740.68 751.62 793.67 802.71 813.61 834.24 850.71 867.04 874.46 896.27 918.33 929.97 937.83 948.50 951.10 957.58 999.90 1004.70 1017.08 1032.67 1038.47 1044.44 1063.53 1069.46 1084.00 1090.43 1095.35 1127.33 1132.12 1140.21 1153.43 1173.87 1179.07 1189.33 1210.82 1216.48 1222.68 1236.61 1253.68 1256.86 1276.06 1283.64 1302.91 1309.23 1312.78 1320.62 1323.43 1341.10 1346.55 1348.38 1365.73 1367.26 1384.45 1398.48 1406.43 1411.02 1415.77 1421.33 1422.69 1425.55 1426.21 1428.80 1482.61 1484.09 1485.92 1488.84 1491.39 1493.60 1494.86 1496.63 1499.75 1503.65 1503.91 1504.54 1507.98 1515.54 1515.99 1571.05 1660.32 1707.54 1766.71 2999.83 3028.73 3030.24 3031.07 3037.71 3042.29 3043.37 3050.62 3054.06 3057.52 3064.59 3065.76 3069.53 3073.10 3075.94 3093.23 3097.48 3104.42 3112.13 3121.98 3128.71 3143.15 3143.69 3147.52 3151.38 3155.83 3167.32 3212.36 3225.86 3914.12
frequency: 16.05 24.28 51.66 66.46 67.70 90.65 108.73 124.63 147.68 157.13 175.71 183.39 203.35 213.94 234.57 237.37 245.65 250.79 261.33 275.63 291.93 303.71 327.97 329.79 359.73 380.03 385.35 403.01 420.85 439.96 459.40 487.77 501.01 512.82 525.48 555.90 582.76 605.34 636.90 649.23 674.86 695.66 740.68 751.62 793.67 802.71 813.61 834.24 850.71 867.04 874.46 896.27 918.33 929.97 937.83 948.50 951.10 957.58 999.90 1004.70 1017.08 1032.67 1038.47 1044.44 1063.53 1069.46 1084.00 1090.43 1095.35 1127.33 1132.12 1140.21 1153.43 1173.87 1179.07 1189.33 1210.82 1216.48 1222.68 1236.61 1253.68 1256.86 1276.06 1283.64 1302.91 1309.23 1312.78 1320.62 1323.43 1341.10 1346.55 1348.38 1365.73 1367.26 1384.45 1398.48 1406.43 1411.02 1415.77 1421.33 1422.69 1425.55 1426.21 1428.80 1482.61 1484.09 1485.92 1488.84 1491.39 1493.60 1494.86 1496.63 1499.75 1503.65 1503.91 1504.54 1507.98 1515.54 1515.99 1571.05 1660.32 1707.54 1766.71 2999.83 3028.73 3030.24 3031.07 3037.71 3042.29 3043.37 3050.62 3054.06 3057.52 3064.59 3065.76 3069.53 3073.10 3075.94 3093.23 3097.48 3104.42 3112.13 3121.98 3128.71 3143.15 3143.69 3147.52 3151.38 3155.83 3167.32 3212.36 3225.86 3914.12
formula: C21H30O2
InChI: InChI=1S/C21H30O2/c1-5-6-7-8-15-12-18(22)20-16-11-14(2)9-10-17(16)21(3,4)23-19(20)13-15/h11-13,16-17,22H,5-10H2,1-4H3
53 atoms
O  -0.585551 1.146186 -1.504178
O  0.066319 -2.146952 1.878764
C  -2.585207 0.427375 -0.417603
C  -1.821531 -0.428976 0.594645
C  -1.770269 1.645091 -0.852997
C  -3.981265 0.693922 0.130048
C  -0.383477 -0.599174 0.15381
C  -4.756458 -0.6207 0.218971
C  -2.59709 -1.711572 0.805087
C  -3.914155 -1.795759 0.645125
C  0.133662 0.180839 -0.880446
C  -2.474443 2.442918 -1.938175
C  -1.354829 2.556487 0.297658
C  0.513535 -1.469533 0.781677
C  1.43932 0.020323 -1.341187
C  -4.659571 -3.080171 0.858915
C  2.285826 -0.893979 -0.746774
C  1.813983 -1.632469 0.334941
C  3.713778 -1.046602 -1.204953
C  4.729147 -0.415817 -0.245367
C  4.571596 1.09103 -0.08847
C  5.598509 1.707104 0.853793
C  5.430593 3.21271 1.010988
H  -2.695117 -0.176086 -1.327109
H  -1.80704 0.102321 1.556315
H  -4.530087 1.397112 -0.497821
H  -3.902547 1.147324 1.122433
H  -5.199275 -0.85572 -0.756261
H  -5.602943 -0.515695 0.904258
H  -2.045372 -2.586273 1.12042
H  -2.826293 1.784539 -2.733093
H  -3.323884 2.992388 -1.534267
H  -1.778102 3.160734 -2.371137
H  -0.794888 3.407676 -0.089622
H  -2.232473 2.933564 0.824296
H  -0.722054 2.036136 1.016026
H  1.774134 0.645784 -2.158627
H  -3.987042 -3.894293 1.126012
H  -5.204631 -3.368891 -0.044101
H  -5.401683 -2.973938 1.654829
H  2.46823 -2.335498 0.841897
H  3.943618 -2.108791 -1.319753
H  3.82327 -0.594037 -2.193358
H  5.737587 -0.640509 -0.605784
H  4.641754 -0.891765 0.736711
H  0.7790 -2.685176 2.222579
H  4.649745 1.567565 -1.07243
H  3.564776 1.316314 0.275944
H  6.606127 1.486149 0.487719
H  5.520176 1.22563 1.833601
H  6.173525 3.631507 1.691027
H  5.535167 3.721844 0.05052
H  4.442376 3.457379 1.40599
totalener: -968.85510164 hartree
nucrepener: 2016.74506589 hartree
electener: -2985.60016753 hartree
oneelecener: -5321.63959244 hartree
twoeener: 2336.03942491 hartree
kineticenergy: 964.32081583 hartree
xcener: -97.507006332142 hartree
chargesum: -0.0000000
charge: -0.312163 -0.306919 -0.017218 0.118863 0.397667 -0.240567 -0.156240 -0.098555 -0.184757 -0.080248 0.241742 -0.290920 -0.351829 0.209991 -0.276824 -0.226475 0.035215 -0.208781 -0.140893 -0.115164 -0.102541 -0.084126 -0.252312 0.079739 0.076759 0.083240 0.076029 0.077474 0.072432 0.087861 0.098817 0.076486 0.098940 0.099217 0.091323 0.099535 0.094425 0.079063 0.082453 0.082984 0.065546 0.093896 0.080388 0.068750 0.058463 0.172704 0.051202 0.065865 0.050688 0.051804 0.082821 0.071397 0.072752
charge: 0.309582 0.356574 -0.058822 -0.058910 -0.242182 -0.003185 -0.065663 -0.014636 0.003242 -0.095168 -0.188857 0.019002 0.026601 -0.182268 -0.019829 0.011229 -0.079641 -0.044026 -0.012111 -0.027550 -0.035953 -0.047221 -0.004721 0.048851 0.040161 0.018937 0.022512 0.027415 0.024874 0.009331 0.019456 0.014674 0.019559 0.019744 0.017838 0.019013 0.021043 0.017885 0.016873 0.015924 0.012033 0.026142 0.027622 0.018131 0.017823 -0.118603 0.018460 0.022367 0.014632 0.015339 0.007387 0.009275 0.009818
qa: -0.3122 -0.3069 -0.0172 0.1189 0.3977 -0.2406 -0.1562 -0.0986 -0.1848 -0.0802 0.2417 -0.2909 -0.3518 0.2100 -0.2768 -0.2265 0.0352 -0.2088 -0.1409 -0.1152 -0.1025 -0.0841 -0.2523 0.0797 0.0768 0.0832 0.0760 0.0775 0.0724 0.0879 0.0988 0.0765 0.0989 0.0992 0.0913 0.0995 0.0944 0.0791 0.0825 0.0830 0.0655 0.0939 0.0804 0.0688 0.0585 0.1727 0.0512 0.0659 0.0507 0.0518 0.0828 0.0714 0.0728
va: 2.1377 2.1493 3.8883 3.8829 3.7122 3.9811 3.6055 3.9312 3.8703 3.8450 3.9855 3.9124 3.9854 3.9130 4.0818 3.9471 3.7610 3.9618 3.8789 3.8629 3.8646 3.8974 3.9513 1.0248 1.0093 1.0112 1.0044 1.0022 1.0112 1.0478 1.0083 1.0040 1.0157 1.0119 1.0047 0.9997 1.0318 1.0113 0.9983 0.9976 1.0279 1.0068 1.0107 1.0151 1.0108 1.0571 1.0112 1.0130 1.0082 1.0068 1.0062 1.0034 1.0040
dispcorr: -0.026276924 hartree
energy: -968.883636604771
dipole: 7.25906 -7.31931 -0.06026 11.61788 -11.65269 -0.03482 2.41485 -2.03460 0.38025
magnitude: 0.38657 au
magnitude: 0.98257 debye
temp: 298.15 k
press: 1.00 atm
zeropoint: 0.47254648 hartree
thermalvibcorrection: 0.02036372 hartree
thermalrotcorrection: 0.00141627 hartree
thermaltrasncorrection: 0.00141627 hartree
thermaltotal: -968.38789387 hartree
thermalcorr: 0.02319626 hartree
nonthermalcorr: 0.47254648 hartree
totalcorr: 0.49574274 hartree
thermalcorrenthalpy: 0.00094421 hartree
totalenthalpy: -968.38694966 hartree
totalentropycorr: -0.07286798 hartree
gibbsenthalpy: -968.45981764 hartree
gibbsminuselec: 0.42381897 hartree
