program: Orca
programVersion: 5.0.3
elementType: O O C C C C C C C C C C C C C C C C C C C C C H H H H H H H H H H H H H H H H H H H H H H H H H H H H H H
charge: 0
multiplicity: 1
keywords: DLPNO-CCSD(T) def2-TZVPP def2-TZVPP/C VeryTightSCF
formula: C21H30O2
InChI: InChI=1S/C21H30O2/c1-5-6-7-8-15-12-18(22)20-16-11-14(2)9-10-17(16)21(3,4)23-19(20)13-15/h9,12-13,16-17,22H,5-8,10-11H2,1-4H3
53 atoms
O  -1.127782 -1.953812 0.882167
O  -0.045736 1.956834 -1.609448
C  -3.002574 -0.573966 0.337943
C  -2.145225 0.40306 -0.471499
C  -2.442786 -1.997511 0.296345
C  -4.463548 -0.43434 -0.072289
C  -2.54114 1.823744 -0.055141
C  -0.674633 0.098327 -0.298974
C  -4.034315 2.029044 -0.058213
C  -0.25363 -1.038173 0.395938
C  -2.333392 -2.578988 -1.110787
C  -3.220394 -2.938005 1.201745
C  -4.883778 1.007938 -0.098187
C  0.333929 0.900723 -0.83195
C  1.090262 -1.299924 0.632783
C  -4.495973 3.455595 -0.026856
C  2.072355 -0.454304 0.14413
C  1.680245 0.645802 -0.607915
C  3.524734 -0.783091 0.406667
C  4.538834 0.305598 0.082842
C  5.961084 -0.093015 0.457506
C  6.994629 0.978127 0.130479
C  8.412517 0.57284 0.511005
H  -2.927596 -0.270037 1.389395
H  -2.40249 0.295531 -1.532838
H  -5.104894 -0.977658 0.6259
H  -4.634151 -0.888221 -1.05543
H  -2.082247 2.552438 -0.721794
H  -2.142175 2.037701 0.943792
H  -1.702796 -1.966231 -1.754184
H  -1.895765 -3.575936 -1.059597
H  -3.316494 -2.661709 -1.574089
H  -2.687623 -3.884544 1.291096
H  -3.328449 -2.509737 2.198741
H  -4.211509 -3.139266 0.796513
H  -5.95057 1.207679 -0.133135
H  1.346761 -2.189856 1.193764
H  -5.582782 3.528071 0.000875
H  -4.135873 4.000411 -0.903258
H  -4.096844 3.971492 0.850627
H  2.417074 1.316998 -1.033762
H  3.624104 -1.059834 1.460233
H  3.780063 -1.685404 -0.158726
H  4.269783 1.22727 0.608891
H  4.507591 0.539247 -0.98609
H  0.737825 2.409594 -1.920601
H  6.003775 -0.321515 1.528031
H  6.227013 -1.021504 -0.059779
H  6.726836 1.905364 0.646427
H  6.952323 1.204175 -0.939537
H  8.716226 -0.334643 -0.015122
H  9.132746 1.354537 0.266608
H  8.490067 0.372981 1.581768
totalener: -962.78472402 hartree
nucrepener: 1964.42130014 hartree
electener: -2927.20602417 hartree
oneelecener: -5214.22656233 hartree
twoeener: 2287.02053817 hartree
kineticenergy: 962.13325970 hartree
chargesum: -0.0000000
charge: -0.414572 -0.403406 -0.100431 0.300969 0.568252 -0.135625 -0.173530 -0.208056 -0.013769 0.331132 -0.329525 -0.258598 -0.154194 0.156864 -0.331091 -0.215079 0.122200 -0.197395 -0.118434 -0.018535 -0.097769 -0.015536 -0.201746 0.072299 0.060114 0.065979 0.051395 0.085067 0.062027 0.082280 0.079551 0.066805 0.077552 0.073105 0.057089 0.059734 0.084608 0.064941 0.062884 0.062364 0.045382 0.062348 0.061334 0.045810 0.028789 0.208882 0.035712 0.033956 0.029043 0.027969 0.049490 0.061565 0.049799
charge: 0.255771 0.318303 -0.045872 -0.039484 -0.213538 -0.009641 0.009665 -0.070778 -0.079711 -0.158379 0.039226 0.033510 -0.021151 -0.147185 -0.026499 0.023604 -0.052897 -0.051540 -0.000403 -0.021829 -0.023999 -0.033644 0.010077 0.040316 0.033345 0.018406 0.017825 0.019281 0.023585 0.014471 0.014401 0.009360 0.013944 0.014200 0.010640 0.005674 0.017635 0.011607 0.010922 0.012392 0.004605 0.024719 0.023941 0.015300 0.011385 -0.116612 0.012831 0.012817 0.009442 0.008875 0.004092 0.002773 0.004222
qa: -0.4146 -0.4034 -0.1004 0.3010 0.5683 -0.1356 -0.1735 -0.2081 -0.0138 0.3311 -0.3295 -0.2586 -0.1542 0.1569 -0.3311 -0.2151 0.1222 -0.1974 -0.1184 -0.0185 -0.0978 -0.0155 -0.2017 0.0723 0.0601 0.0660 0.0514 0.0851 0.0620 0.0823 0.0796 0.0668 0.0776 0.0731 0.0571 0.0597 0.0846 0.0649 0.0629 0.0624 0.0454 0.0623 0.0613 0.0458 0.0288 0.2089 0.0357 0.0340 0.0290 0.0280 0.0495 0.0616 0.0498
va: 1.9655 2.0247 4.0962 3.6487 3.5418 3.9694 3.9362 3.4960 3.7137 3.9200 4.0193 3.9272 3.8644 3.9331 4.1022 3.9806 3.8205 3.8247 3.8578 3.8437 3.9007 3.8610 3.9704 1.0207 1.0114 1.0060 1.0079 1.0257 1.0129 0.9989 1.0117 1.0058 1.0150 1.0099 1.0040 1.0160 1.0286 1.0037 0.9991 0.9985 1.0268 1.0065 1.0040 1.0180 1.0142 1.0289 1.0149 1.0157 1.0140 1.0132 1.0046 1.0064 1.0047
e0: -962.784724023 hartree
corrType: DLPNO BASED
energy: -967.060725262964
dipole: 15.72339 -15.42146 0.30194 1.18270 -0.93898 0.24372 1.29391 -1.65513 -0.36122
magnitude: 0.53014 au
magnitude: 1.34750 debye
