program: Gaussian 09
title: 000005323
version: EM64L-G09RevD.01
frameworkgroup: C1[X(C12H14N4O4S)]
method: RPBEPBE
basis: SDD
operation: Freq
keyword: #p
keyword: freq=noraman
keyword: PBEPBE/SDD
title: #p freq=noraman PBEPBE/SDD
converged: YES YES NO NO
title: Mulliken charges:
elementType: S O O O O N N N N C C C C C C C C C C C C H H H H H H H H H H H H H H
charge: 0.973020 -0.541672 -0.500792 -0.257480 -0.215045 -0.643466 -0.123401 -0.686109 -0.050471 -0.056465 -0.216181 -0.188312 0.365532 0.516404 -0.390896 -0.406050 -0.454775 0.220150 -0.005471 -0.508811 -0.509578 0.344311 0.277643 0.279643 0.232583 0.232634 0.255807 0.316624 0.316331 0.228755 0.243869 0.242412 0.241014 0.240757 0.227486
chargesum: 0.00000
title: Mulliken charges with hydrogens summed into heavy atoms:
elementType: S O O O O N N N N C C C C C C C C C C C C
charge: 0.973020 -0.541672 -0.500792 -0.257480 -0.215045 -0.299155 -0.123401 -0.053155 -0.050471 -0.056465 0.061462 0.091330 0.365532 0.516404 -0.158312 -0.173415 -0.198968 0.220150 -0.005471 0.206225 0.199679
polarizability: 2.77913585e+02 -2.08545392e+01 2.10820906e+02 -5.38667218e+00 -1.48880233e+01 1.52136082e+02
1716.lowfreq: -5.5466 -2.4246 -0.0015 -0.0009 -0.0004 6.3402 15.9921 20.3070 43.8551
frequency: 15.7958 20.2688 43.8446 61.6407 82.1220 100.5585 108.8419 134.6969 139.8245 142.6504 169.4099 187.0679 189.6775 209.6185 214.8208 229.6250 246.3490 249.1699 268.9713 300.1530 323.1798 397.5310 404.6384 414.2610 414.6962 415.6480 439.8354 448.4043 460.0062 491.3574 518.0549 567.0150 592.0826 617.8235 622.5714 635.2314 656.2132 671.1362 716.2998 729.4165 755.1891 799.9249 812.9776 813.7324 821.6158 834.1187 881.7318 917.4861 946.7830 949.7585 951.0219 963.1416 981.1338 1019.5549 1022.4058 1052.6290 1066.6408 1112.5823 1125.0822 1131.7379 1150.8988 1158.4264 1164.2538 1183.7745 1258.1749 1300.6584 1318.6378 1324.1865 1337.2274 1373.4971 1401.2433 1408.1220 1436.0573 1443.0482 1448.9493 1452.2156 1461.1682 1465.3128 1470.7848 1490.8619 1524.9938 1543.8437 1588.0014 1614.9364 1649.7264 2993.3659 3005.8789 3094.8516 3110.0134 3134.0694 3136.8618 3137.4354 3144.5934 3166.2478 3174.6434 3196.5678 3492.7867 3561.8370 3700.3903
redmass: 5.4431 4.8464 4.4487 5.9702 5.4354 3.9746 3.0134 2.8868 6.0668 1.5373 3.6707 1.7960 3.3048 3.7520 5.2098 5.6549 7.6899 5.1303 4.8718 6.1338 5.6946 5.2025 3.5487 3.4130 2.7221 1.2904 1.6632 2.9902 3.1529 2.1112 2.7234 6.5082 4.7881 6.3746 6.8444 5.7520 8.3400 3.9235 2.9635 3.5970 4.2670 7.4003 1.3079 5.6249 2.0007 1.8323 7.9473 9.7894 8.0970 2.0803 2.8670 1.4202 4.9836 3.1335 1.4437 2.5108 4.4227 1.2527 1.2459 1.1928 1.3888 1.5629 1.6676 1.1207 2.1758 1.2924 5.8825 2.7047 3.1975 2.3596 5.2563 2.8516 3.7315 1.3483 1.0508 1.0611 1.6271 1.2301 1.0663 2.9618 7.2136 6.5198 7.4222 4.7909 1.2269 1.0296 1.0288 1.1046 1.1046 1.0899 1.1026 1.0907 1.1054 1.0959 1.0950 1.0939 1.0778 1.0453 1.1040
irintensity: 1.0856 0.7642 1.0824 0.3171 0.5578 3.8206 8.1606 0.5564 0.3493 1.8562 5.2792 0.0280 2.1742 3.6524 5.0593 8.8642 2.7126 5.8851 18.9928 19.4388 5.5171 3.1245 6.0699 29.2851 33.3535 1.5130 110.6321 272.2041 100.2879 41.3162 30.8805 7.0918 27.1970 143.8365 1.2480 20.2939 10.2152 12.2998 5.7507 121.8822 3.3586 54.2744 6.4777 54.6019 90.0643 84.0691 6.4611 2.2247 54.0435 10.0819 6.2785 2.6322 8.4723 104.8143 0.9923 49.5661 101.8268 0.1913 1.1768 11.4769 34.5054 183.5339 29.0435 31.1485 184.0766 4.1644 36.6601 77.5384 350.0273 46.0441 1.2224 32.3585 1.0785 24.0062 13.6988 13.2053 38.8362 24.4527 35.2425 72.3401 247.7683 971.5661 11.5989 167.9669 267.1485 37.2703 51.3256 23.8041 25.3980 9.5091 32.6708 13.7660 26.2239 3.8056 5.1813 0.2899 49.3320 119.2687 26.0132
temp: 298.150 k
press: 1.00000 atm
elementType: 16 8 8 8 8 7 7 7 7 6 6 6 6 6 6 6 6 6 6 6 6 1 1 1 1 1 1 1 1 1 1 1 1 1 1
symmnumber: 1
zpe: 673666.8 jmol-1
zpe.correction: 0.256586 hartree
zpe.thermalcorrener: 0.277898 hartree
zpe.thermalcorrenthalpy: 0.278842 hartree
zpe.thermalcorrgfe: 0.204913 hartree
zpe.sumelectzpe: -1381.907074 hartree
zpe.sumelectthermal: -1381.885762 hartree
zpe.sumelectthermalent: -1381.884818 hartree
zpe.sumelectthermalfe: -1381.958747 hartree
dipole: 3.9974 -5.1913 -4.0240
dipole: 7.6891
quadrupole: -98.1679 -130.1069 -129.0084
quadrupole: -26.5295 -9.7015 -7.7371
quadrupole: 20.9266 -11.0125 -9.9140 -26.5295 -9.7015 -7.7371
hfenergy: -1382.1636599 hartree
pointgroup: C01 [X(C12H14N4O4S1)]
dipole: -1.5963637 2.0014875 1.6115242 debye
polarizability: 261.2585137|14.4313464|152.2002104|-35.2561776|8.8988038|227.4118494 unknown
InChI: InChI=1S/C12H14N4O4S/c1-19-11-7-10(14-12(15-11)20-2)16-21(17,18)9-5-3-8(13)4-6-9/h3-7,16H,13H2,1-2H3
charge 0 multiplicity 1
35 atoms
S  -1.140742 -1.70846 -1.178573
O  -2.05471 -2.099687 -2.47004
O  -0.279768 -2.830726 -0.387689
O  4.19647 1.814569 -2.413421
O  2.563088 0.618273 1.780091
N  -0.050316 -0.427291 -2.003748
N  1.234903 0.07672 -0.088868
N  -4.607377 1.249651 2.787946
N  3.373581 1.229421 -0.279218
C  -2.172482 -0.761277 0.039304
C  -3.240939 0.011403 -0.450917
C  -1.891932 -0.899607 1.409144
C  1.122102 0.086658 -1.459117
C  -3.800752 0.581656 1.87694
C  -4.053255 0.687984 0.473465
C  -2.713029 -0.228254 2.329569
C  2.117734 0.648955 -2.29495
C  3.223389 1.231534 -1.628204
C  2.36517 0.631672 0.415007
C  5.364275 2.392867 -1.708561
C  1.53006 -0.054309 2.592846
H  -0.126507 -0.561588 -3.020314
H  -3.441323 0.065934 -1.525408
H  -1.062016 -1.533504 1.734206
H  -4.89208 1.295985 0.11624
H  -2.521527 -0.329117 3.404053
H  2.05535 0.651573 -3.383606
H  -5.387704 1.820537 2.475226
H  -4.440252 1.17565 3.787538
H  5.996984 2.787331 -2.516665
H  5.88952 1.615354 -1.129661
H  5.042803 3.193606 -1.022245
H  1.413192 -1.105043 2.275541
H  0.561508 0.464752 2.492165
H  1.911683 0.010778 3.622225
