program: Gaussian 09
title: 000034560
version: EM64L-G09RevD.01
frameworkgroup: C1[X(C14H14N2O)]
method: RPBEPBE
basis: SDD
operation: Freq
keyword: #p
keyword: freq=noraman
keyword: PBEPBE/SDD
title: #p freq=noraman PBEPBE/SDD
converged: YES YES NO NO
title: Mulliken charges:
elementType: O N N C C C C C C C C C C C C C C H H H H H H H H H H H H H H
charge: -0.257524 -0.083566 -0.132979 0.423237 -0.045889 -0.541849 0.337689 -0.286170 -0.343893 -0.797710 0.179593 -0.297629 -0.346719 -0.201601 -0.204819 -0.240398 -0.536976 0.260447 0.273811 0.242606 0.216048 0.241701 0.241659 0.270464 0.248249 0.226232 0.228899 0.228887 0.225369 0.225439 0.247392
chargesum: 0.00000
title: Mulliken charges with hydrogens summed into heavy atoms:
elementType: O N N C C C C C C C C C C C C C C
charge: -0.257524 -0.083566 -0.132979 0.423237 -0.045889 -0.281402 0.337689 -0.012358 -0.101287 -0.098302 0.179593 -0.027165 -0.098470 0.024631 0.024079 -0.011511 0.161224
polarizability: 4.11236510e+02 1.52041340e+00 1.71463911e+02 3.59206518e-03 3.75348280e-02 7.42799541e+01
1716.lowfreq: -7.6327 0.0006 0.0008 0.0010 4.1620 5.6086 20.6460 44.0686 63.7318
frequency: 20.6105 44.0667 63.7258 86.9973 109.6753 112.9826 169.6023 182.3620 214.9757 231.9656 233.4403 243.4721 269.5866 340.4208 379.9149 407.0017 454.0290 454.5592 471.8388 521.1591 544.0713 576.1265 590.8036 610.4968 620.9265 692.4358 704.4736 744.7335 781.8729 789.6094 822.6224 851.2780 881.4802 888.8227 905.2508 938.3183 974.4505 977.4738 985.2322 985.4027 998.9863 1014.4126 1024.6157 1046.7306 1073.7002 1100.7225 1111.2487 1142.3991 1148.0034 1169.3539 1173.4213 1184.0421 1228.1667 1240.3104 1276.7498 1303.6417 1348.1830 1381.3201 1389.4577 1398.7867 1426.6273 1439.2992 1443.4006 1457.8700 1463.0627 1467.9077 1469.6784 1474.4009 1484.7700 1566.6561 1582.3952 1601.9048 1615.8609 2966.7638 2991.9372 3057.6785 3077.0525 3093.4936 3125.8024 3129.8773 3136.8911 3149.4499 3151.0565 3156.7490 3164.2979 3169.0846 3171.1435
redmass: 3.7094 4.8746 4.6948 3.1709 2.8191 1.2696 4.4040 3.1794 2.2412 1.7602 3.3906 4.9946 4.6111 3.4991 5.0665 2.9018 2.9714 5.0970 6.7644 3.3456 5.0411 4.8110 2.9125 6.5617 6.2699 1.8695 6.2049 3.0338 1.8115 5.5121 1.4580 1.2471 1.4502 5.3997 7.1350 1.4430 1.3545 2.2294 5.8492 1.3864 1.3206 2.0685 2.0499 1.5666 1.5189 2.2712 1.2590 1.4778 1.5215 1.0611 1.6493 1.5594 2.9203 3.3667 1.7880 1.4246 8.1839 6.9395 8.9433 1.2597 1.8269 1.4104 2.2781 1.0467 2.2344 1.0498 1.1900 1.9811 1.4476 7.4771 6.2491 6.2796 6.3076 1.0326 1.0361 1.1043 1.0967 1.1009 1.0851 1.0999 1.0886 1.0869 1.0930 1.0920 1.0961 1.0961 1.0992
irintensity: 0.4875 0.7493 1.7356 1.5983 4.5575 2.6913 0.1732 2.5284 0.1080 0.5366 4.2935 2.5467 1.1892 0.4643 0.1028 0.0047 3.0679 0.8344 50.2447 12.9518 30.4327 1.1870 6.8127 0.4195 0.3341 51.2570 5.9596 7.5455 41.6639 0.4646 43.1878 0.1223 27.8645 0.7122 1.1373 7.2400 1.5484 28.0667 0.2273 0.0051 0.6983 10.4422 44.4729 10.3545 9.9315 81.0700 0.1345 8.5835 33.2116 0.1500 13.6888 0.9288 166.1509 255.4282 136.5412 5.1267 47.3311 1.5433 0.5191 17.2287 17.0867 1.1523 13.2863 12.8879 18.0722 14.0469 45.4043 42.2928 67.5411 46.9618 3.0081 0.6240 301.8745 90.4972 22.4162 43.9712 13.6469 26.7394 3.3880 28.0345 10.3632 5.8210 23.6068 9.5117 23.6452 20.8711 28.1157
temp: 298.150 k
press: 1.00000 atm
elementType: 8 7 7 6 6 6 6 6 6 6 6 6 6 6 6 6 6 1 1 1 1 1 1 1 1 1 1 1 1 1 1
symmnumber: 1
zpe: 643995.4 jmol-1
zpe.correction: 0.245285 hartree
zpe.thermalcorrener: 0.260842 hartree
zpe.thermalcorrenthalpy: 0.261786 hartree
zpe.thermalcorrgfe: 0.201091 hartree
zpe.sumelectzpe: -725.357136 hartree
zpe.sumelectthermal: -725.341579 hartree
zpe.sumelectthermalent: -725.340635 hartree
zpe.sumelectthermalfe: -725.401330 hartree
dipole: 1.3494 -1.2705 0.0036
dipole: 1.8534
quadrupole: -74.8109 -86.8252 -105.1288
quadrupole: -9.9120 0.0111 0.0009
quadrupole: 14.1108 2.0964 -16.2072 -9.9120 0.0111 0.0009
hfenergy: -725.602421 hartree
pointgroup: C01 [X(C14H14N2O1)]
dipole: 0.5385756 0.4907463 0.0280612 debye
polarizability: 410.9263934|-5.5696921|171.4711122|8.0778802|3.1211249|74.5828698 unknown
InChI: InChI=1S/C14H14N2O/c1-11-10-13(17-2)8-9-14(11)16-15-12-6-4-3-5-7-12/h3-10H,1-2H3
charge 0 multiplicity 1
31 atoms
O  5.105547 0.022595 0.12301
N  -0.515662 -0.42833 -0.031399
N  -1.238905 0.666332 -0.010512
C  1.706238 -1.406502 -0.007467
C  0.893319 -0.222136 0.010392
C  3.105195 -1.259539 0.03254
C  3.707873 0.022889 0.088358
C  1.508222 1.060103 0.066524
C  2.903914 1.195426 0.105263
C  1.079276 -2.785777 -0.067784
C  -2.654024 0.443369 -0.053811
C  -3.280742 -0.834954 -0.114415
C  -3.450966 1.618971 -0.032046
C  -4.684708 -0.920631 -0.152145
C  -4.857992 1.524473 -0.070324
C  -5.479432 0.254894 -0.130403
C  5.791277 1.318288 0.181258
H  3.759222 -2.137009 0.021005
H  0.856379 1.939281 0.078431
H  3.354761 2.191207 0.147432
H  1.854756 -3.570548 -0.072671
H  0.409523 -2.955091 0.793636
H  0.455798 -2.89841 -0.972203
H  -2.649403 -1.728622 -0.13048
H  -2.941999 2.587561 0.015034
H  -5.16971 -1.902503 -0.198746
H  -5.467927 2.434328 -0.053306
H  -6.572177 0.17842 -0.159835
H  5.516719 1.876274 1.09681
H  5.565561 1.931242 -0.712232
H  6.862865 1.072902 0.202786
