program: Orca
programVersion: 5.0.3
elementType: O O C C C C C C C C C C C C C C C C C C C C C H H H H H H H H H H H H H H H H H H H H H H H H H H H H H H
charge: 0
multiplicity: 1
keywords: DLPNO-CCSD(T) def2-TZVPP def2-TZVPP/C VeryTightSCF
formula: C21H30O2
InChI: InChI=1S/C21H30O2/c1-5-6-7-8-15-12-18(22)20-16-11-14(2)9-10-17(16)21(3,4)23-19(20)13-15/h9,12-13,16-17,22H,5-8,10-11H2,1-4H3
53 atoms
O  -0.769345 -1.730357 0.943418
O  -0.238431 1.540591 -2.543488
C  -2.717443 -0.399747 0.593559
C  -2.067886 0.38486 -0.550912
C  -2.181267 -1.829477 0.686885
C  -4.232113 -0.260544 0.509408
C  -2.328611 1.871899 -0.267154
C  -0.604709 0.030609 -0.6952
C  -3.784579 2.150926 0.013391
C  -0.031329 -0.965642 0.097625
C  -2.401426 -2.657828 -0.576264
C  -2.730217 -2.556815 1.902921
C  -4.632086 1.17682 0.328212
C  0.237403 0.652546 -1.623632
C  1.331052 -1.234736 0.062035
C  -4.208225 3.585445 -0.092469
C  2.158263 -0.540758 -0.805931
C  1.596723 0.39201 -1.668223
C  3.644336 -0.781338 -0.804825
C  4.376603 0.126784 0.185691
C  5.884094 -0.098955 0.189935
C  6.655318 0.832799 1.123015
C  6.343412 0.629315 2.6016
H  -2.397019 0.080562 1.525975
H  -2.60094 0.123842 -1.477972
H  -4.697398 -0.644067 1.420406
H  -4.633005 -0.86499 -0.312457
H  -2.007051 2.513917 -1.090256
H  -1.716079 2.184631 0.585796
H  -3.465562 -2.785441 -0.775384
H  -1.9411 -2.197409 -1.449869
H  -1.958873 -3.645041 -0.444832
H  -2.19491 -3.496074 2.03965
H  -2.599432 -1.954309 2.802322
H  -3.789457 -2.780415 1.779869
H  -5.677512 1.419436 0.492446
H  1.719898 -2.008826 0.711446
H  -5.261865 3.71362 0.152423
H  -4.040301 3.969994 -1.101834
H  -3.621612 4.212105 0.58453
H  2.20001 0.914333 -2.399913
H  3.846952 -1.825552 -0.552496
H  4.04355 -0.617101 -1.809169
H  3.962323 -0.040845 1.18328
H  4.16233 1.171456 -0.062259
H  -1.194332 1.512471 -2.556719
H  6.093499 -1.13893 0.464978
H  6.26193 0.026638 -0.829567
H  6.447522 1.87087 0.844992
H  7.726183 0.684865 0.960884
H  6.964938 1.271225 3.227172
H  5.302286 0.858335 2.832606
H  6.528468 -0.404991 2.900826
totalener: -962.78209993 hartree
nucrepener: 1984.19985306 hartree
electener: -2946.98195298 hartree
oneelecener: -5253.25689883 hartree
twoeener: 2306.27494585 hartree
kineticenergy: 962.12815169 hartree
chargesum: -0.0000000
charge: -0.414795 -0.391595 -0.136076 0.247296 0.575742 -0.136927 -0.182518 -0.231161 -0.012403 0.310388 -0.328111 -0.258665 -0.144923 0.179086 -0.335814 -0.210332 0.202660 -0.244419 -0.120540 -0.100011 -0.069711 -0.044358 -0.199004 0.077335 0.065461 0.070142 0.053714 0.057528 0.075231 0.067197 0.082359 0.082575 0.079663 0.074282 0.056887 0.064995 0.082032 0.067756 0.060909 0.067134 0.085212 0.069192 0.069581 0.049356 0.048873 0.221709 0.034468 0.045888 0.027564 0.046056 0.062167 0.052052 0.048873
charge: 0.255302 0.317644 -0.044619 -0.051545 -0.215748 -0.008264 0.006639 -0.083102 -0.082614 -0.160773 0.039917 0.034567 -0.015565 -0.149875 -0.025964 0.024621 -0.056129 -0.028477 -0.000531 -0.014238 -0.024921 -0.032048 0.010027 0.042213 0.026984 0.020099 0.018542 0.015655 0.028539 0.009393 0.014086 0.015845 0.014964 0.014521 0.010571 0.007835 0.016704 0.013124 0.010658 0.014066 0.016761 0.021058 0.020687 0.013298 0.015425 -0.126315 0.011851 0.012130 0.009664 0.008809 0.002583 0.001720 0.004228
qa: -0.4148 -0.3916 -0.1361 0.2473 0.5757 -0.1369 -0.1825 -0.2312 -0.0124 0.3104 -0.3281 -0.2587 -0.1449 0.1791 -0.3358 -0.2103 0.2027 -0.2444 -0.1205 -0.1000 -0.0697 -0.0444 -0.1990 0.0773 0.0655 0.0701 0.0537 0.0575 0.0752 0.0672 0.0824 0.0826 0.0797 0.0743 0.0569 0.0650 0.0820 0.0678 0.0609 0.0671 0.0852 0.0692 0.0696 0.0494 0.0489 0.2217 0.0345 0.0459 0.0276 0.0461 0.0622 0.0521 0.0489
va: 1.9644 2.0471 4.1656 3.6521 3.5358 3.9658 3.9205 3.3498 3.6860 3.9417 4.0164 3.9293 3.8653 3.9890 4.0684 3.9809 3.6650 3.9878 3.8494 3.8477 3.8708 3.8869 3.9578 1.0204 1.0058 1.0073 1.0084 1.0286 1.0156 1.0056 0.9988 1.0122 1.0150 1.0098 1.0042 1.0159 1.0300 1.0036 0.9994 0.9986 1.0260 1.0117 1.0124 1.0201 1.0221 1.0158 1.0162 1.0150 1.0164 1.0101 1.0064 1.0016 1.0052
e0: -962.782099927 hartree
corrType: DLPNO BASED
energy: -967.060062951375
dipole: 10.81841 -11.70850 -0.89008 1.52348 -1.57835 -0.05488 9.14742 -9.04901 0.09841
magnitude: 0.89719 au
magnitude: 2.28047 debye
