program: Gaussian 09
title: 000034561
version: EM64L-G09RevD.01
frameworkgroup: C1[X(C14H14N2O)]
method: RPBEPBE
basis: SDD
operation: Freq
keyword: #p
keyword: freq=noraman
keyword: PBEPBE/SDD
title: #p freq=noraman PBEPBE/SDD
converged: YES YES NO NO
title: Mulliken charges:
elementType: O N N C C C C C C C C C C C C C C H H H H H H H H H H H H H H
charge: -0.256793 -0.103055 -0.115455 0.372340 -0.004650 -0.396168 -0.294603 0.149091 -0.794550 -0.230023 -0.221387 0.321134 -0.290870 -0.321207 -0.316947 -0.331615 -0.537767 0.233160 0.273247 0.211838 0.239703 0.239941 0.226981 0.227312 0.271121 0.253402 0.241588 0.254964 0.225413 0.225351 0.248501
chargesum: 0.00000
title: Mulliken charges with hydrogens summed into heavy atoms:
elementType: O N N C C C C C C C C C C C C C C
charge: -0.256793 -0.103055 -0.115455 0.372340 -0.004650 -0.163007 -0.021355 0.149091 -0.103067 -0.003042 0.005925 0.321134 -0.019749 -0.067805 -0.075358 -0.076651 0.161499
polarizability: 4.11369966e+02 2.96533934e+00 1.70828377e+02 -5.59069554e-02 9.84764821e-02 7.44412931e+01
1716.lowfreq: -7.6899 -2.7416 -0.0003 0.0007 0.0008 6.6181 17.4094 44.2373 59.5412
frequency: 17.4055 44.2317 59.5307 89.9605 105.4119 117.0775 169.3502 185.9044 195.2128 217.9369 233.5929 261.4947 284.4838 369.5899 379.9495 422.3060 455.1197 455.4656 478.3238 512.8949 536.0222 553.3775 555.3428 617.4686 629.8906 723.7303 727.6772 739.8266 779.4513 781.6830 816.9515 833.1732 846.6928 880.1168 898.3621 963.9380 969.1458 976.2876 982.6285 984.9476 991.9711 995.1923 1038.6738 1045.6925 1094.4519 1105.3688 1111.3784 1143.7202 1155.6486 1166.8637 1179.1528 1202.1481 1221.4940 1245.2516 1278.1607 1290.2303 1347.1988 1376.7118 1382.2040 1398.5721 1425.7701 1433.2247 1438.1768 1458.8106 1468.2074 1469.7349 1471.2973 1476.1104 1486.1152 1571.0334 1581.4485 1601.1227 1611.1806 2966.1765 2989.1991 3056.9091 3074.3929 3088.8988 3122.3465 3129.9062 3134.4968 3148.7200 3152.6731 3153.3026 3167.7047 3169.1076 3176.3542
redmass: 3.5871 4.7657 4.5873 3.6680 1.1236 3.7629 4.3146 2.8868 3.4288 4.9799 1.4397 3.5317 4.1413 3.6863 5.1662 3.2208 4.5215 2.9383 5.4283 2.7946 5.2080 6.1447 2.9543 6.7698 7.0330 2.5108 5.2948 2.9332 1.5911 5.2166 1.2644 5.5104 1.6421 1.3194 7.3996 1.3741 1.3679 1.3415 8.7355 1.5808 2.5161 1.3325 1.9853 1.5642 2.1188 1.3472 1.2592 1.3522 1.4011 1.1202 1.7025 2.7848 3.1244 4.5339 1.5558 1.3403 7.6522 6.2349 6.5653 1.2803 2.0726 1.9562 1.7092 1.0469 1.0499 1.9132 1.2969 1.1707 2.3281 7.6806 6.7849 6.0279 6.3146 1.0326 1.0360 1.1042 1.0968 1.1006 1.0857 1.0998 1.0901 1.0872 1.0883 1.0950 1.0981 1.0957 1.0972
irintensity: 1.0329 0.4573 1.6350 0.7910 1.7231 2.5043 0.4617 7.2218 0.2448 2.3201 1.8327 1.3236 0.0008 4.3265 0.1260 0.0032 10.2918 4.1854 51.5376 12.5220 14.6085 6.5758 14.4111 0.2133 1.0545 13.2645 4.1508 19.9467 41.2007 4.6654 2.8338 0.4503 86.0191 1.7174 0.0721 1.1206 1.8582 0.3872 63.9908 1.9960 8.8675 0.3481 9.4816 9.7872 5.2676 26.7575 0.1836 130.4487 11.0257 10.2317 22.6013 12.9170 95.9254 319.7784 0.9120 0.4165 51.9942 6.9555 8.5330 14.1165 5.5283 0.2072 24.5790 12.2365 14.4068 40.5977 65.2074 23.6374 71.8130 2.4538 2.7683 2.4274 277.8279 87.4459 28.1214 44.3327 15.3937 28.8751 5.2622 28.3072 20.9670 9.9713 2.3733 31.0655 35.9405 9.8127 10.9684
temp: 298.150 k
press: 1.00000 atm
elementType: 8 7 7 6 6 6 6 6 6 6 6 6 6 6 6 6 6 1 1 1 1 1 1 1 1 1 1 1 1 1 1
symmnumber: 1
zpe: 643856.9 jmol-1
zpe.correction: 0.245232 hartree
zpe.thermalcorrener: 0.260782 hartree
zpe.thermalcorrenthalpy: 0.261726 hartree
zpe.thermalcorrgfe: 0.200864 hartree
zpe.sumelectzpe: -725.356719 hartree
zpe.sumelectthermal: -725.341169 hartree
zpe.sumelectthermalent: -725.340225 hartree
zpe.sumelectthermalfe: -725.401087 hartree
dipole: 1.6398 2.1173 0.0081
dipole: 2.6781
quadrupole: -74.6702 -88.1712 -105.1319
quadrupole: 9.4482 0.0179 0.0304
quadrupole: 14.6542 1.1533 -15.8075 9.4482 0.0179 0.0304
hfenergy: -725.6019507 hartree
pointgroup: C01 [X(C14H14N2O1)]
dipole: 0.6677883 0.8149925 -0.0044178 debye
polarizability: 411.1366834|-3.5811763|170.8318352|-8.5200585|1.265916|74.6711178 unknown
InChI: InChI=1S/C14H14N2O/c1-11-5-3-4-6-14(11)16-15-12-7-9-13(17-2)10-8-12/h3-10H,1-2H3
charge 0 multiplicity 1
31 atoms
O  5.378161 -0.2891 -0.153177
N  -0.990169 0.302446 0.013123
N  -0.245238 -0.776704 -0.019602
C  -3.234407 1.22025 0.076059
C  -2.401258 0.055794 0.04647
C  -4.637912 1.032699 0.110564
C  -2.977943 -1.246918 0.05164
C  1.159703 -0.533503 -0.050959
C  -2.640119 2.615967 0.070797
C  -5.209771 -0.259507 0.116073
C  -4.374032 -1.403805 0.08636
C  3.980752 -0.295754 -0.118162
C  1.772448 0.751329 -0.042838
C  1.982845 -1.694618 -0.092656
C  3.171532 0.874781 -0.075816
C  3.379993 -1.582046 -0.126399
C  6.060674 1.009385 -0.151638
H  -5.289599 1.914086 0.133369
H  -2.304014 -2.108843 0.028157
H  -3.436875 3.379644 0.090591
H  -1.980502 2.772593 0.942686
H  -2.015635 2.781046 -0.824937
H  -6.299327 -0.374366 0.143129
H  -4.815726 -2.406569 0.090447
H  1.128283 1.635553 -0.010048
H  1.494337 -2.67431 -0.098122
H  3.625684 1.870342 -0.068296
H  4.027243 -2.463106 -0.159098
H  5.837313 1.578517 0.771069
H  5.781878 1.61005 -1.03856
H  7.132681 0.767766 -0.188625
