program: Orca
programVersion: 5.0.3
elementType: O O C C C C C C C C C C C C C C C C C C C C C H H H H H H H H H H H H H H H H H H H H H H H H H H Ag
elementType: Ag
charge: 1
multiplicity: 1
keywords: wB97X-D3 TightOpt Freq def2-TZVPP def2/J RIJCOSX VeryTightSCF defgrid3
frequency: 0.00 0.00 0.00 0.00 0.00 0.00 -26.08 17.64 22.86 34.68 49.63 66.13 81.28 91.13 107.35 140.10 146.26 153.66 175.54 199.57 215.97 224.78 237.67 258.78 269.69 278.63 300.10 320.33 321.84 329.14 335.71 356.25 365.34 389.57 409.05 419.26 438.36 457.98 486.53 502.38 515.21 539.72 557.59 565.57 592.09 617.49 653.69 684.68 701.22 702.89 721.99 765.59 773.83 779.43 814.07 854.41 859.30 875.60 884.25 887.34 894.45 917.85 937.61 941.38 944.89 957.83 997.67 1012.85 1015.64 1020.74 1023.64 1051.42 1065.26 1076.91 1098.08 1102.92 1110.24 1122.72 1132.52 1163.24 1180.46 1191.07 1201.47 1215.68 1235.05 1236.90 1251.83 1271.26 1297.97 1319.41 1323.43 1326.13 1328.19 1344.78 1347.52 1358.51 1366.56 1372.93 1385.88 1395.81 1408.66 1418.14 1427.67 1431.27 1453.43 1472.78 1483.16 1486.17 1492.89 1496.80 1500.51 1502.35 1503.92 1505.56 1506.24 1509.61 1511.71 1528.02 1550.07 1561.18 1643.50 1651.78 1662.99 1698.65 2839.93 2969.01 3005.79 3022.55 3051.79 3067.31 3078.12 3080.74 3082.02 3092.48 3100.51 3118.48 3126.46 3131.54 3135.36 3139.40 3151.61 3156.48 3163.33 3174.03 3183.78 3189.30 3200.83 3225.02 3267.92 3890.56
frequency: 17.64 22.86 34.68 49.63 66.13 81.28 91.13 107.35 140.10 146.26 153.66 175.54 199.57 215.97 224.78 237.67 258.78 269.69 278.63 300.10 320.33 321.84 329.14 335.71 356.25 365.34 389.57 409.05 419.26 438.36 457.98 486.53 502.38 515.21 539.72 557.59 565.57 592.09 617.49 653.69 684.68 701.22 702.89 721.99 765.59 773.83 779.43 814.07 854.41 859.30 875.60 884.25 887.34 894.45 917.85 937.61 941.38 944.89 957.83 997.67 1012.85 1015.64 1020.74 1023.64 1051.42 1065.26 1076.91 1098.08 1102.92 1110.24 1122.72 1132.52 1163.24 1180.46 1191.07 1201.47 1215.68 1235.05 1236.90 1251.83 1271.26 1297.97 1319.41 1323.43 1326.13 1328.19 1344.78 1347.52 1358.51 1366.56 1372.93 1385.88 1395.81 1408.66 1418.14 1427.67 1431.27 1453.43 1472.78 1483.16 1486.17 1492.89 1496.80 1500.51 1502.35 1503.92 1505.56 1506.24 1509.61 1511.71 1528.02 1550.07 1561.18 1643.50 1651.78 1662.99 1698.65 2839.93 2969.01 3005.79 3022.55 3051.79 3067.31 3078.12 3080.74 3082.02 3092.48 3100.51 3118.48 3126.46 3131.54 3135.36 3139.40 3151.61 3156.48 3163.33 3174.03 3183.78 3189.30 3200.83 3225.02 3267.92 3890.56
formula: C21H26O2Ag
InChI: InChI=1S/C21H26O2.Ag/c1-5-6-7-8-15-12-18(22)20-16-11-14(2)9-10-17(16)21(3,4)23-19(20)13-15;/h9-13,22H,5-8H2,1-4H3;
50 atoms
O  -0.651991 -1.105091 -1.36923
O  -1.694736 2.843511 1.036406
C  -1.539272 -1.941139 -0.576095
C  -2.759326 -1.130633 -0.191082
C  -2.622355 0.24146 0.051514
C  -1.28521 0.842026 -0.144698
C  -0.354094 0.103541 -0.885344
C  -1.83958 -3.114501 -1.490543
C  -0.771216 -2.40198 0.663656
C  1.296227 1.908712 -0.816579
C  2.626996 2.514387 -1.18902
C  0.931784 0.599755 -1.209526
C  -4.001907 -1.727066 -0.041004
C  -0.861208 2.11112 0.28095
C  -3.75412 0.980157 0.399799
C  3.701617 2.351159 -0.09527
C  0.395051 2.626421 -0.056015
C  -5.000029 0.386205 0.543226
C  4.477235 1.030044 -0.157561
C  -5.106859 -0.982801 0.3292
C  5.032651 0.561034 1.186861
C  -6.208417 1.205413 0.899745
C  3.97168 -0.043021 2.102457
H  -0.904021 -3.552464 -1.836415
H  -2.398769 -3.886871 -0.966363
H  -2.414093 -2.788794 -2.355729
H  0.142598 -2.928251 0.374261
H  -0.536958 -1.55925 1.323842
H  -1.383268 -3.086721 1.248931
H  2.984553 2.083024 -2.126052
H  2.47047 3.576649 -1.37683
H  1.497371 0.067048 -1.966865
H  -4.120434 -2.787841 -0.216035
H  -3.67059 2.042935 0.559125
H  3.223267 2.477162 0.881231
H  4.416427 3.170714 -0.176348
H  0.652068 3.626894 0.275554
H  3.849202 0.227866 -0.577043
H  5.291068 1.134051 -0.876799
H  -6.066376 -1.472732 0.443081
H  5.506881 1.400313 1.700282
H  5.81553 -0.180271 1.023394
H  -6.809452 0.708497 1.66118
H  -5.92749 2.18774 1.276009
H  -6.845468 1.352438 0.025799
H  -1.301545 3.692468 1.246234
H  3.605381 -1.007886 1.682575
H  4.357147 -0.325528 3.081464
H  3.152661 0.662855 2.3058
Ag 1.837322 -0.404928 0.644546
totalener: -1113.27437400 hartree
nucrepener: 2372.84178710 hartree
electener: -3486.11616110 hartree
oneelecener: -6268.31063960 hartree
twoeener: 2782.19447850 hartree
kineticenergy: 1018.18364965 hartree
xcener: -106.135340758811 hartree
chargesum: 1.0000000
charge: -0.300864 -0.271629 0.387217 -0.165820 0.046377 0.075507 0.053516 -0.259430 -0.342665 -0.026270 -0.187178 -0.152158 -0.105972 0.212828 -0.137468 -0.179166 -0.105951 -0.012580 -0.078426 -0.113657 -0.183576 -0.211732 -0.099845 0.104845 0.088097 0.128749 0.109765 0.079188 0.129718 0.108121 0.117251 0.221871 0.132054 0.119949 0.087698 0.116418 0.097120 0.023796 0.121147 0.127624 0.095705 0.098398 0.099228 0.084038 0.109306 0.193472 0.026316 0.131944 0.063213 0.343915
charge: 0.336741 0.403743 -0.219090 -0.047211 -0.048138 -0.049264 -0.189883 0.035183 0.036483 -0.060373 0.009802 -0.057315 0.008765 -0.157877 0.030653 -0.012033 -0.018964 -0.072879 -0.019618 0.016531 -0.019494 0.030772 0.040234 0.023884 0.022441 0.029645 0.025048 0.021801 0.036365 0.038260 0.038659 0.046901 0.027674 0.016752 0.023893 0.030946 0.027567 0.020963 0.033399 0.030405 0.033790 0.030243 0.024331 0.020315 0.026652 -0.097688 0.032267 0.036883 0.029035 0.392806
qa: -0.3009 -0.2716 0.3872 -0.1658 0.0464 0.0755 0.0535 -0.2594 -0.3427 -0.0263 -0.1872 -0.1522 -0.1060 0.2128 -0.1375 -0.1792 -0.1060 -0.0126 -0.0784 -0.1137 -0.1836 -0.2117 -0.0998 0.1048 0.0881 0.1287 0.1098 0.0792 0.1297 0.1081 0.1173 0.2219 0.1321 0.1199 0.0877 0.1164 0.0971 0.0238 0.1211 0.1276 0.0957 0.0984 0.0992 0.0840 0.1093 0.1935 0.0263 0.1319 0.0632 0.3439
va: 2.1728 2.2186 3.7539 3.9084 3.8539 3.4741 3.9355 3.9147 3.9261 3.7272 3.9579 3.8037 3.9469 3.9237 3.9741 3.8116 3.9522 3.8875 3.7196 4.0252 4.0245 3.9149 3.9136 1.0107 1.0069 1.0050 1.0039 0.9948 1.0161 1.0045 1.0052 1.0096 0.9983 1.0470 1.0075 1.0139 1.0214 1.0315 1.0037 1.0043 1.0084 1.0112 0.9998 1.0078 0.9944 1.0448 1.0180 1.0005 1.0168 1.2404
dispcorr: -0.027421909 hartree
energy: -1113.301796335243
dipole: -116.74950 118.86772 2.11822 37.45807 -37.01502 0.44305 -29.70980 30.62266 0.91285
magnitude: 2.34871 au
magnitude: 5.96996 debye
temp: 298.15 k
press: 1.00 atm
zeropoint: 0.42633467 hartree
thermalvibcorrection: 0.02050774 hartree
thermalrotcorrection: 0.00141627 hartree
thermaltrasncorrection: 0.00141627 hartree
thermaltotal: -1112.85212139 hartree
thermalcorr: 0.02334028 hartree
nonthermalcorr: 0.42633467 hartree
totalcorr: 0.44967495 hartree
thermalcorrenthalpy: 0.00094421 hartree
totalenthalpy: -1112.85117718 hartree
totalentropycorr: -0.07382741 hartree
gibbsenthalpy: -1112.92500459 hartree
gibbsminuselec: 0.37679175 hartree
