program: Orca
programVersion: 5.0.3
elementType: O O C C C C C C C C C C C C C C C C C C C C C H H H H H H H H H H H H H H H H H H H H H H H H H H H H H H H H Ag
elementType: Ag
charge: 1
multiplicity: 1
keywords: DLPNO-CCSD(T) def2-TZVPP def2-TZVPP/C VeryTightSCF NormalPNO
formula: C21H32O2Ag
InChI: InChI=1S/C21H32O2.Ag/c1-5-6-7-11-18-14-20(22)19(21(23)15-18)13-12-17(4)10-8-9-16(2)3;/h9,12,14-15,22-23H,5-8,10-11,13H2,1-4H3;
56 atoms
O  0.469527 1.407685 -2.280538
O  -1.791634 2.967131 1.604659
C  -4.269606 -1.363399 -0.117253
C  -3.932283 -0.391327 -1.255629
C  -3.149663 -2.326097 0.289912
C  -2.798145 0.552663 -0.954313
C  -2.060317 -1.781905 1.221006
C  -0.60478 2.193424 -0.256522
C  0.617961 2.946629 0.220078
C  -1.654504 0.564378 -1.743461
C  -2.870175 1.405999 0.139436
C  -0.589256 1.40496 -1.419597
C  -1.785626 2.191506 0.496716
C  2.699561 1.497061 0.617853
C  3.421897 0.500229 1.492243
C  1.508146 1.996062 0.986599
C  3.644234 -0.864754 0.818133
C  -2.558451 -1.286663 2.571771
C  3.431958 1.90623 -0.631885
C  2.410551 -1.722131 0.679021
C  1.953029 -2.334098 -0.449629
C  0.964538 -3.46758 -0.368307
C  2.544689 -2.121895 -1.816205
H  -4.622358 -0.807648 0.754864
H  -5.124777 -1.956056 -0.446319
H  -3.691624 -0.960769 -2.155489
H  -4.825287 0.19294 -1.490515
H  -2.680788 -2.727898 -0.614169
H  -3.604245 -3.183379 0.793341
H  -1.523829 -0.959744 0.718016
H  -1.332703 -2.580081 1.38569
H  0.30226 3.757559 0.873654
H  1.146977 3.418688 -0.608996
H  -1.590607 -0.029589 -2.645939
H  -3.765888 1.428978 0.750004
H  2.881379 0.363781 2.431498
H  4.400055 0.913423 1.749857
H  1.111523 1.706359 1.958633
H  4.345386 -1.434949 1.432816
H  4.137005 -0.73013 -0.143967
H  -3.108434 -2.07115 3.093717
H  -1.728589 -0.983013 3.211084
H  -3.222868 -0.428492 2.470388
H  3.384235 1.135095 -1.403608
H  4.488131 2.061611 -0.408285
H  3.056518 2.833463 -1.059278
H  1.98888 -2.069738 1.621765
H  1.03851 2.161098 -2.114867
H  -2.647124 2.930885 2.034712
H  1.473278 -4.39248 -0.650633
H  0.137682 -3.340534 -1.068287
H  0.566027 -3.598819 0.63581
H  1.762672 -2.077547 -2.574451
H  3.178461 -2.976193 -2.066261
H  3.147953 -1.221404 -1.895044
Ag 0.598557 -0.317042 0.086084
totalener: -1109.86725776 hartree
nucrepener: 2572.79265509 hartree
electener: -3682.65991285 hartree
oneelecener: -6668.58905778 hartree
twoeener: 2985.92914493 hartree
kineticenergy: 1019.87321301 hartree
chargesum: 1.0000000
charge: -0.400716 -0.392305 -0.096343 -0.165477 -0.106419 0.082495 -0.002658 -0.061603 -0.131499 -0.244485 -0.228240 0.312854 0.294269 -0.021339 -0.093934 -0.163475 -0.154696 -0.213998 -0.256604 -0.175070 0.079350 -0.215386 -0.184929 0.050663 0.094856 0.077937 0.106481 0.046693 0.086221 -0.060166 0.061149 0.138910 0.096500 0.126589 0.083409 0.084075 0.103150 0.143717 0.110408 0.093433 0.089022 0.059832 0.051272 0.078868 0.113422 0.079557 0.137258 0.244891 0.229968 0.120490 0.073829 0.079347 0.085646 0.119462 0.062919 0.470400
charge: 0.338998 0.335866 -0.004276 0.009555 -0.008790 -0.044616 -0.021832 -0.073590 0.007626 -0.010604 -0.018638 -0.166366 -0.152102 -0.060849 0.005646 0.000205 0.000314 0.021782 0.038716 -0.013979 -0.064193 0.043203 0.046672 0.012427 0.022847 0.026198 0.031571 0.014050 0.023071 0.008557 0.013731 0.040162 0.019087 0.028410 0.019394 0.030788 0.031827 0.032444 0.033756 0.023604 0.015434 0.006288 0.000760 0.014659 0.028986 0.012046 0.032993 -0.111347 -0.099008 0.030937 0.020780 0.018878 0.025922 0.031207 0.013531 0.337258
qa: -0.4007 -0.3923 -0.0963 -0.1655 -0.1064 0.0825 -0.0027 -0.0616 -0.1315 -0.2445 -0.2282 0.3129 0.2943 -0.0213 -0.0939 -0.1635 -0.1547 -0.2140 -0.2566 -0.1751 0.0794 -0.2154 -0.1849 0.0507 0.0949 0.0779 0.1065 0.0467 0.0862 -0.0602 0.0611 0.1389 0.0965 0.1266 0.0834 0.0841 0.1031 0.1437 0.1104 0.0934 0.0890 0.0598 0.0513 0.0789 0.1134 0.0796 0.1373 0.2449 0.2300 0.1205 0.0738 0.0793 0.0856 0.1195 0.0629 0.4704
va: 2.0223 2.0466 3.8707 3.8695 3.9152 3.7778 3.8141 3.4422 3.8453 3.8109 3.9505 3.7893 3.9468 3.5337 3.8398 3.6709 3.9494 3.9815 3.9688 3.6804 3.6852 3.9673 3.9547 1.0135 1.0097 1.0127 1.0063 1.0180 1.0088 1.0346 1.0050 1.0161 1.0100 1.0155 1.0115 1.0200 1.0093 1.0207 1.0057 0.9979 1.0091 1.0105 1.0006 0.9906 1.0055 1.0091 1.0264 1.0056 1.0168 1.0000 1.0061 0.9978 1.0063 1.0001 1.0050 1.0724
e0: -1109.867257734 hartree
corrType: DLPNO BASED
energy: -1114.840317116802
dipole: -39.87619 40.61639 0.74020 7.49167 -7.99112 -0.49944 -0.60958 0.92712 0.31754
magnitude: 0.94772 au
magnitude: 2.40892 debye
