program: Orca
programVersion: 5.0.3
elementType: O O C C C C C C C C C C C C C C C C C C C C C H H H H H H H H H H H H H H H H H H H H H H H H H H H H H H H H Ag
elementType: Ag
charge: 1
multiplicity: 1
keywords: DLPNO-CCSD(T) def2-TZVPP def2-TZVPP/C VeryTightSCF NormalPNO
formula: C21H32O2Ag
InChI: InChI=1S/C21H32O2.Ag/c1-5-6-7-11-18-14-20(22)19(21(23)15-18)13-12-17(4)10-8-9-16(2)3;/h9,12,14-15,22-23H,5-8,10-11,13H2,1-4H3;
56 atoms
O  0.046743 0.043436 2.672956
O  -1.253444 3.3402 -0.460415
C  -4.366588 -1.142659 -0.56996
C  -2.892362 -1.247339 -0.98499
C  -4.607624 -1.40831 0.912064
C  -2.027657 -0.221159 -0.302377
C  -6.082542 -1.398432 1.309753
C  -0.465303 1.734607 1.043482
C  0.59582 2.668355 1.582845
C  -1.25081 -0.576737 0.823479
C  -2.048581 1.099293 -0.703036
C  -0.55402 0.425235 1.527312
C  -1.276394 2.0604 -0.043101
C  2.537264 1.983116 0.103645
C  3.862462 1.28906 -0.073261
C  1.968854 2.081586 1.305934
C  3.825811 0.126121 -1.075007
C  -6.756865 -0.040002 1.156216
C  1.930837 2.555647 -1.14859
C  3.12348 -1.117889 -0.598132
C  2.507234 -2.056772 -1.378543
C  2.268357 -3.453807 -0.860179
C  2.301184 -1.889425 -2.859742
H  -4.739685 -0.152157 -0.841696
H  -4.93726 -1.8602 -1.164975
H  -2.521345 -2.24851 -0.752923
H  -2.814787 -1.120221 -2.066621
H  -4.074723 -0.663558 1.51341
H  -4.175114 -2.380466 1.171288
H  -6.16225 -1.72136 2.349999
H  -6.620364 -2.146206 0.719605
H  0.469083 2.841864 2.654976
H  0.481445 3.645594 1.118301
H  -1.388212 -1.542114 1.297416
H  -2.654774 1.395405 -1.552121
H  4.232985 0.933524 0.890489
H  4.592058 2.015612 -0.440802
H  2.507321 1.668035 2.153741
H  4.858465 -0.177884 -1.274944
H  3.431349 0.465077 -2.032715
H  -6.223718 0.728395 1.72095
H  -6.800484 0.28159 0.114526
H  -7.781322 -0.069114 1.526525
H  1.203372 3.335953 -0.940823
H  1.418589 1.789115 -1.74038
H  2.707453 2.977613 -1.788327
H  3.378071 -1.423535 0.416632
H  0.44244 0.795308 3.117752
H  -1.852093 3.467524 -1.198092
H  2.993597 -4.123254 -1.330015
H  1.280522 -3.829182 -1.129533
H  2.39759 -3.527662 0.218803
H  1.37886 -2.371312 -3.183689
H  3.119272 -2.386844 -3.387249
H  2.284145 -0.850594 -3.180847
Ag 0.838852 -0.856116 -0.185344
totalener: -1109.87228991 hartree
nucrepener: 2467.55213148 hartree
electener: -3577.42442139 hartree
oneelecener: -6458.64118897 hartree
twoeener: 2881.21676759 hartree
kineticenergy: 1019.76269504 hartree
chargesum: 1.0000000
charge: -0.382898 -0.384780 -0.108515 -0.132805 -0.074979 -0.154840 -0.065807 0.011034 -0.090260 -0.032618 -0.065767 0.168490 0.208475 -0.088328 -0.094635 -0.115855 -0.131761 -0.196248 -0.220037 -0.196628 0.114089 -0.179482 -0.202412 0.052564 0.078204 0.067535 0.094195 0.041310 0.053093 0.058760 0.040359 0.114860 0.123654 0.196716 0.087755 0.075995 0.100748 0.076390 0.108636 0.081980 0.050574 0.047185 0.079645 0.100262 0.033269 0.111631 0.135874 0.242581 0.232177 0.111842 0.074304 0.078528 0.086093 0.116724 0.078189 0.384938
charge: 0.356509 0.350041 -0.004469 0.006443 -0.024592 -0.036821 -0.026107 -0.073804 -0.001687 -0.045015 -0.024584 -0.156106 -0.140441 -0.078750 0.002618 -0.010382 -0.003096 0.014049 0.038614 -0.007295 -0.083141 0.044104 0.046308 0.014960 0.021495 0.026397 0.026962 0.013869 0.013059 0.014280 0.013291 0.023517 0.036703 0.038011 0.021502 0.027453 0.031038 0.010995 0.035506 0.023021 0.004859 0.000622 0.009525 0.018369 0.012443 0.023292 0.036565 -0.098383 -0.097071 0.031692 0.021113 0.024498 0.023784 0.032457 0.017130 0.404651
qa: -0.3829 -0.3848 -0.1085 -0.1328 -0.0750 -0.1548 -0.0658 0.0110 -0.0903 -0.0326 -0.0658 0.1685 0.2085 -0.0883 -0.0946 -0.1159 -0.1318 -0.1962 -0.2200 -0.1966 0.1141 -0.1795 -0.2024 0.0526 0.0782 0.0675 0.0942 0.0413 0.0531 0.0588 0.0404 0.1149 0.1237 0.1967 0.0878 0.0760 0.1007 0.0764 0.1086 0.0820 0.0506 0.0472 0.0796 0.1003 0.0333 0.1116 0.1359 0.2426 0.2322 0.1118 0.0743 0.0785 0.0861 0.1167 0.0782 0.3849
va: 2.0904 2.0593 3.9189 3.8950 3.8627 3.8287 3.9101 3.4392 3.7508 3.4730 3.8722 4.0285 4.0352 3.6232 3.8895 3.7551 3.9221 3.9559 3.9530 3.7611 3.6569 3.9438 3.9553 1.0153 1.0153 1.0151 1.0060 1.0128 1.0141 1.0111 1.0160 1.0074 1.0174 0.9928 1.0101 1.0194 1.0073 1.0227 1.0057 1.0030 1.0047 1.0022 1.0087 1.0140 1.0022 1.0037 1.0257 1.0069 1.0141 0.9991 1.0075 1.0065 1.0063 1.0000 1.0022 1.2591
e0: -1109.872289911 hartree
corrType: DLPNO BASED
energy: -1114.840272096195
dipole: -76.84960 78.07726 1.22765 48.35202 -48.72081 -0.36879 5.52316 -6.61757 -1.09441
magnitude: 1.68549 au
magnitude: 4.28417 debye
