program: Gaussian 09
title: 000034556
version: EM64L-G09RevD.01
frameworkgroup: C1[X(C16H18N2)]
method: RPBEPBE
basis: SDD
operation: Freq
keyword: #pfreq=noraman
keyword: PBEPBE/SDD
title: #p freq=noraman PBEPBE/SDD
converged: YES YES NO NO
title: Mulliken charges:
elementType: N N C C C C C C C C C C C C C C C C H H H H H H H H H H H H H H H H H H
charge: -0.117231 -0.117240 0.358219 0.358212 0.326308 0.326297 -0.554111 -0.554118 0.176347 0.176358 -0.384824 -0.384835 -0.315007 -0.314984 -0.808961 -0.808960 -0.809964 -0.809958 0.253257 0.253259 0.229969 0.229977 0.273639 0.273632 0.234093 0.225488 0.225796 0.225526 0.225754 0.234090 0.228056 0.231205 0.227726 0.228071 0.231206 0.227706
chargesum: 0.00000
title: Mulliken charges with hydrogens summed into heavy atoms:
elementType: N N C C C C C C C C C C C C C C C C
charge: -0.117231 -0.117240 0.358219 0.358212 0.326308 0.326297 -0.300854 -0.300859 0.176347 0.176358 -0.154855 -0.154858 -0.041368 -0.041352 -0.123583 -0.123589 -0.122977 -0.122974
polarizability: 4.44378815e+02 -4.42122671e+00 1.85834514e+02 -4.46294230e-03 1.08169651e-03 9.13854816e+01
1716.lowfreq: -0.0007 -0.0004 0.0002 4.7883 9.9779 18.9488 26.3847 41.9131 58.8834
frequency: 26.3845 41.9130 58.8832 87.6126 110.8761 111.2476 157.9525 161.0929 163.5375 169.7300 181.8891 211.0454 243.5443 243.7088 294.0207 298.1045 335.2328 363.0204 382.1540 427.1130 446.7986 447.3303 460.4436 523.1099 542.0071 553.3001 561.6552 608.7645 623.0655 721.6427 722.5698 733.4370 736.2571 742.5939 842.5670 846.3981 846.5523 910.0863 914.6688 932.5771 941.2080 981.1059 982.8601 990.2136 990.7034 1001.2657 1007.3162 1030.0167 1030.1797 1052.8704 1052.8764 1102.4955 1110.3540 1154.3512 1172.7833 1188.0658 1199.4393 1243.9338 1259.7810 1274.4923 1276.0059 1353.5247 1377.1695 1381.0925 1393.3331 1393.5502 1404.3649 1406.1348 1409.7208 1411.3860 1460.9296 1460.9488 1469.9056 1471.3563 1476.1887 1476.2427 1478.9892 1479.0871 1484.3363 1488.8659 1568.7950 1570.6407 1617.4038 1617.4183 2967.6973 2967.9181 2971.2408 2971.3075 3038.2855 3038.3147 3044.4677 3044.4793 3084.4890 3084.5193 3087.4561 3087.4839 3120.4994 3120.7113 3141.3981 3141.5139 3167.7701 3167.9661
redmass: 3.4024 4.2350 4.3211 4.0688 1.0744 1.0762 1.9688 2.6536 1.1589 1.4327 5.0047 4.3317 2.8733 3.4616 2.5080 2.5961 4.5385 3.4458 4.5059 3.1558 2.8040 2.8203 6.3592 4.1055 5.5687 4.2719 3.2635 3.3020 5.7188 2.7979 6.4939 2.6062 4.2987 3.9897 1.3250 1.3657 6.3638 1.3891 1.4455 3.3990 2.7293 1.3374 1.3547 1.6548 1.6353 1.4786 1.5169 1.4608 1.4614 1.6516 1.6513 1.7911 1.5951 1.4780 1.6977 3.3261 2.4836 3.4217 4.2085 1.4315 1.3691 11.3080 5.7289 5.2541 1.2360 1.2419 1.6613 1.3852 2.0403 2.5803 1.0469 1.0468 1.1951 1.1820 1.0458 1.0459 1.3219 1.2158 2.0729 2.3492 6.6227 6.9402 6.4655 6.5693 1.0378 1.0378 1.0382 1.0382 1.0966 1.0966 1.0967 1.0967 1.0984 1.0984 1.0978 1.0978 1.0896 1.0896 1.0916 1.0916 1.0942 1.0942
irintensity: 0.1187 1.9329 1.5192 0.0000 0.0922 0.0003 0.0003 1.9053 1.9653 0.0002 0.0000 0.0000 4.1258 0.0011 0.7248 0.0000 0.0002 9.6315 6.8690 0.0000 0.0003 9.4165 7.8714 0.0000 12.2260 8.0436 0.0001 7.5569 0.0002 0.0009 4.7206 13.2952 0.0055 1.4713 0.0002 45.0563 0.1753 0.0002 27.2194 0.0001 0.7338 0.0003 8.2035 0.0003 9.1593 0.0005 46.4145 0.0121 34.8058 0.4618 0.0230 0.0000 39.0214 0.0000 4.5877 0.0001 25.3184 0.0001 95.0703 6.3224 0.0002 0.0000 9.5004 0.0000 9.5549 0.0069 23.2955 0.0002 5.2893 0.0001 1.6905 0.0148 48.1112 0.0690 0.2148 61.1520 0.0517 6.5178 0.0006 43.0329 34.2253 0.0000 40.5811 0.4478 136.3959 0.0612 54.3699 0.0018 8.4070 64.9202 4.1070 8.8072 7.6242 59.5492 6.6918 4.8262 59.1222 1.1872 10.6462 0.6285 12.9518 0.2452
temp: 298.150 k
press: 1.00000 atm
elementType: 7 7 6 6 6 6 6 6 6 6 6 6 6 6 6 6 6 6 1 1 1 1 1 1 1 1 1 1 1 1 1 1 1 1 1 1
symmnumber: 1
zpe: 775934.4 jmol-1
zpe.correction: 0.295538 hartree
zpe.thermalcorrener: 0.313331 hartree
zpe.thermalcorrenthalpy: 0.314276 hartree
zpe.thermalcorrgfe: 0.249367 hartree
zpe.sumelectzpe: -728.691722 hartree
zpe.sumelectthermal: -728.673928 hartree
zpe.sumelectthermalent: -728.672984 hartree
zpe.sumelectthermalfe: -728.737892 hartree
dipole: 0.0002 0.0001 0.0031
dipole: 0.0031
quadrupole: -71.8082 -97.9225 -112.1449
quadrupole: 0.7478 -0.0017 -0.0041
quadrupole: 22.1503 -3.9640 -18.1864 0.7478 -0.0017 -0.0041
hfenergy: -728.9872593 hartree
pointgroup: C01 [X(C16H18N2)]
dipole: -0.00006 0.0012067 0.0000298 debye
polarizability: 444.1464084|0.0799973|91.3932513|8.9208227|-0.8536186|186.0591509 unknown
InChI: InChI=1S/C16H18N2/c1-11-5-7-15(9-13(11)3)17-18-16-8-6-12(2)14(4)10-16/h5-10H,1-4H3
charge 0 multiplicity 1
36 atoms
N  -0.453833 -0.215441 0.472762
N  0.453311 -0.207332 -0.472697
C  -4.177382 -0.220411 0.69502
C  4.176852 -0.204057 -0.694811
C  -4.570655 -0.207549 -0.679666
C  4.570116 -0.215619 0.679889
C  -2.801035 -0.222392 1.010764
C  2.800501 -0.202235 -1.010601
C  -1.805302 -0.212219 -0.000454
C  1.804771 -0.210873 0.000595
C  -3.56523 -0.197203 -1.685165
C  3.564666 -0.224792 1.685375
C  -2.196461 -0.199397 -1.367349
C  2.195903 -0.222559 1.367515
C  -5.216892 -0.231734 1.801441
C  5.216381 -0.194183 -1.80123
C  -6.036868 -0.203645 -1.067409
C  6.03635 -0.217464 1.067596
H  -2.466981 -0.23185 2.054487
H  2.466562 -0.193511 -2.054361
H  -3.874969 -0.186884 -2.737442
H  3.874334 -0.2336 2.737679
H  -1.42329 -0.191128 -2.141186
H  1.422726 -0.229229 2.141371
H  -4.740273 -0.236008 2.796073
H  -5.879404 0.653719 1.74742
H  -5.871661 -1.122257 1.73631
H  5.877058 0.691583 -1.731957
H  5.872989 -1.084335 -1.751419
H  4.739766 -0.182189 -2.795805
H  -6.562375 0.683389 -0.663004
H  -6.161268 -0.199461 -2.163385
H  -6.565936 -1.091138 -0.669009
H  6.56097 0.677461 0.679788
H  6.160859 -0.233701 2.163451
H  6.566202 -1.096858 0.652613
