program: Orca
programVersion: 5.0.3
elementType: O O C C C C C C C C C C C C C C C C C C C C C H H H H H H H H H H H H H H H H H H H H H H H H H H H H H H H H Ag
elementType: Ag
charge: 1
multiplicity: 1
keywords: wB97X-D3 TightOpt Freq def2-TZVPP def2/J RIJCOSX TIGHTSCF defgrid3 CHELPG
frequency: 0.00 0.00 0.00 0.00 0.00 0.00 16.06 23.31 31.28 33.30 46.17 52.70 61.13 74.53 79.16 94.45 100.63 119.87 123.91 130.81 141.98 154.60 168.90 184.97 188.80 218.68 230.63 232.51 240.15 257.56 264.59 300.13 308.39 319.89 328.02 345.72 364.13 373.52 396.90 401.15 411.09 435.39 451.67 460.34 499.21 507.18 525.85 536.33 556.90 578.69 596.17 622.65 637.87 696.19 745.15 746.94 762.98 780.70 790.33 804.74 850.61 871.89 876.34 882.42 888.31 899.70 923.16 936.10 967.20 975.04 990.80 1000.47 1002.77 1015.52 1022.27 1036.32 1043.57 1054.07 1067.82 1078.36 1103.61 1104.88 1107.07 1124.38 1128.37 1137.83 1168.61 1172.21 1186.79 1205.71 1213.70 1236.07 1246.37 1254.18 1264.15 1271.32 1272.33 1299.61 1321.99 1326.32 1336.13 1339.45 1351.87 1358.77 1369.22 1377.23 1390.57 1392.13 1401.82 1410.32 1415.01 1427.20 1427.55 1434.41 1435.94 1475.44 1477.18 1482.43 1486.87 1490.51 1490.59 1491.90 1495.04 1498.07 1498.67 1498.85 1505.84 1508.50 1509.71 1511.66 1515.39 1566.74 1655.01 1658.09 1687.44 1719.19 3024.53 3043.86 3046.49 3052.94 3057.24 3063.98 3064.60 3065.71 3066.78 3071.83 3073.08 3091.85 3095.80 3111.98 3115.12 3119.40 3121.06 3123.08 3123.61 3126.09 3130.06 3137.51 3138.78 3148.48 3152.91 3169.08 3176.18 3188.37 3188.74 3190.81 3897.56 3897.93
frequency: 16.06 23.31 31.28 33.30 46.17 52.70 61.13 74.53 79.16 94.45 100.63 119.87 123.91 130.81 141.98 154.60 168.90 184.97 188.80 218.68 230.63 232.51 240.15 257.56 264.59 300.13 308.39 319.89 328.02 345.72 364.13 373.52 396.90 401.15 411.09 435.39 451.67 460.34 499.21 507.18 525.85 536.33 556.90 578.69 596.17 622.65 637.87 696.19 745.15 746.94 762.98 780.70 790.33 804.74 850.61 871.89 876.34 882.42 888.31 899.70 923.16 936.10 967.20 975.04 990.80 1000.47 1002.77 1015.52 1022.27 1036.32 1043.57 1054.07 1067.82 1078.36 1103.61 1104.88 1107.07 1124.38 1128.37 1137.83 1168.61 1172.21 1186.79 1205.71 1213.70 1236.07 1246.37 1254.18 1264.15 1271.32 1272.33 1299.61 1321.99 1326.32 1336.13 1339.45 1351.87 1358.77 1369.22 1377.23 1390.57 1392.13 1401.82 1410.32 1415.01 1427.20 1427.55 1434.41 1435.94 1475.44 1477.18 1482.43 1486.87 1490.51 1490.59 1491.90 1495.04 1498.07 1498.67 1498.85 1505.84 1508.50 1509.71 1511.66 1515.39 1566.74 1655.01 1658.09 1687.44 1719.19 3024.53 3043.86 3046.49 3052.94 3057.24 3063.98 3064.60 3065.71 3066.78 3071.83 3073.08 3091.85 3095.80 3111.98 3115.12 3119.40 3121.06 3123.08 3123.61 3126.09 3130.06 3137.51 3138.78 3148.48 3152.91 3169.08 3176.18 3188.37 3188.74 3190.81 3897.56 3897.93
formula: C21H32O2Ag
InChI: InChI=1S/C21H32O2.Ag/c1-5-6-7-11-18-14-20(22)19(21(23)15-18)13-12-17(4)10-8-9-16(2)3;/h9,12,14-15,22-23H,5-8,10-11,13H2,1-4H3;
56 atoms
O  0.055368 1.808407 -2.65183
O  -0.912659 2.860851 1.815327
C  -3.408672 -1.68836 -0.108748
C  -3.852088 -0.287379 -0.544099
C  -4.545891 -2.702489 -0.10399
C  -2.695835 0.671761 -0.516653
C  -4.104214 -4.12133 0.249422
C  -0.367368 2.283656 -0.38606
C  0.856831 3.180787 -0.305999
C  -1.871925 0.81044 -1.62665
C  -2.379917 1.357769 0.650086
C  -0.736319 1.614731 -1.571255
C  -1.243166 2.154741 0.711703
C  2.994838 1.789427 -0.039899
C  3.902389 1.006251 0.881316
C  1.950671 2.471045 0.461829
C  3.763797 -0.521466 0.727645
C  -3.566333 -4.272702 1.667802
C  3.36387 1.757394 -1.495965
C  2.455544 -1.085621 1.223563
C  1.675304 -2.039902 0.635824
C  0.603583 -2.750976 1.423762
C  1.971691 -2.648556 -0.708717
H  -2.614905 -2.034675 -0.781435
H  -2.961548 -1.618357 0.887626
H  -4.275585 -0.33206 -1.549521
H  -4.644441 0.067298 0.118198
H  -5.017671 -2.710115 -1.090614
H  -5.317648 -2.375738 0.600546
H  -3.34786 -4.452319 -0.469689
H  -4.954956 -4.792979 0.118178
H  0.589078 4.101857 0.210579
H  1.173757 3.446551 -1.31022
H  -2.11925 0.299881 -2.550948
H  -3.023409 1.274144 1.518867
H  3.707445 1.284094 1.919219
H  4.940874 1.272195 0.672348
H  1.834451 2.496911 1.543174
H  4.551217 -0.994949 1.320965
H  3.954028 -0.814511 -0.304319
H  -3.325635 -5.312906 1.886988
H  -2.657197 -3.689214 1.827878
H  -4.302395 -3.942678 2.403776
H  3.514189 0.735539 -1.849785
H  4.315262 2.27551 -1.635732
H  2.622302 2.223767 -2.137742
H  2.229129 -0.852664 2.263827
H  -0.332011 1.3971 -3.426127
H  -1.597343 2.784109 2.481829
H  -0.322438 -2.844656 0.854754
H  0.389221 -2.259607 2.371911
H  0.94131 -3.767407 1.640584
H  1.050662 -2.851266 -1.255569
H  2.467168 -3.61123 -0.559869
H  2.618144 -2.03543 -1.332148
Ag 0.773987 0.188723 0.261563
totalener: -1116.88345751 hartree
nucrepener: 2480.36308130 hartree
electener: -3597.24653881 hartree
oneelecener: -6486.89383879 hartree
twoeener: 2889.64729998 hartree
kineticenergy: 1021.67598721 hartree
xcener: -107.337381555801 hartree
chargesum: 1.0000000
charge: -0.287770 -0.284355 -0.141887 -0.101361 -0.129265 0.014744 -0.102751 0.003476 -0.184280 -0.210504 -0.212709 0.240395 0.292930 0.009316 -0.137904 -0.154722 -0.200216 -0.248920 -0.243958 -0.123828 0.049820 -0.192384 -0.216299 0.062870 0.067043 0.092250 0.093243 0.078529 0.073095 0.052337 0.086769 0.129945 0.127886 0.095919 0.095651 0.099062 0.113517 0.166420 0.117866 0.108757 0.100942 0.038340 0.089630 0.091668 0.127109 0.096049 0.169737 0.196423 0.196251 0.072148 0.095020 0.129821 0.101096 0.133472 0.090273 0.173294
charge: 0.378254 0.383217 -0.029510 -0.000673 -0.030480 -0.060356 -0.041374 -0.084020 0.010135 -0.018419 -0.017092 -0.188053 -0.184890 -0.074160 0.001746 -0.006023 -0.007593 -0.001744 0.033401 -0.022639 -0.093382 0.031490 0.035822 0.019069 0.017755 0.033548 0.034329 0.023445 0.023473 0.015641 0.023029 0.042219 0.034994 0.026544 0.026976 0.036731 0.038094 0.034609 0.041718 0.026151 0.014566 -0.001467 0.014475 0.021505 0.034497 0.019972 0.042689 -0.098442 -0.097217 0.023980 0.028955 0.036513 0.029755 0.038214 0.020643 0.359383
qa: -0.2878 -0.2844 -0.1419 -0.1014 -0.1293 0.0147 -0.1028 0.0035 -0.1843 -0.2105 -0.2127 0.2404 0.2929 0.0093 -0.1379 -0.1547 -0.2002 -0.2489 -0.2440 -0.1238 0.0498 -0.1924 -0.2163 0.0629 0.0670 0.0923 0.0932 0.0785 0.0731 0.0523 0.0868 0.1299 0.1279 0.0959 0.0957 0.0991 0.1135 0.1664 0.1179 0.1088 0.1009 0.0383 0.0896 0.0917 0.1271 0.0960 0.1697 0.1964 0.1963 0.0721 0.0950 0.1298 0.1011 0.1335 0.0903 0.1733
va: 2.1971 2.2028 3.8350 3.8697 3.9148 3.8138 3.8834 3.5647 3.9787 3.9762 3.9932 3.8927 3.8923 3.5930 3.9255 3.6831 3.9678 3.9307 3.9660 3.6989 3.7646 3.9275 3.9352 1.0115 1.0069 1.0136 1.0122 1.0138 1.0117 1.0108 1.0106 1.0187 1.0066 1.0246 1.0241 1.0117 1.0074 1.0202 1.0069 0.9967 1.0073 1.0016 1.0053 1.0008 1.0004 1.0228 1.0224 1.0439 1.0429 1.0061 1.0084 0.9995 1.0063 0.9970 1.0127 1.6045
dispcorr: -0.031814344 hartree
energy: -1116.925220831665
dipole: -60.60035 61.20273 0.60238 -35.68359 35.17204 -0.51155 -10.26804 10.26412 -0.00392
magnitude: 0.79029 au
magnitude: 2.00876 debye
temp: 298.15 k
press: 1.00 atm
zeropoint: 0.49265236 hartree
thermalvibcorrection: 0.02527492 hartree
thermalrotcorrection: 0.00141627 hartree
thermaltrasncorrection: 0.00141627 hartree
thermaltotal: -1116.40446101 hartree
thermalcorr: 0.02810746 hartree
nonthermalcorr: 0.49265236 hartree
totalcorr: 0.52075982 hartree
thermalcorrenthalpy: 0.00094421 hartree
totalenthalpy: -1116.40351680 hartree
totalentropycorr: -0.08357907 hartree
gibbsenthalpy: -1116.48709588 hartree
gibbsminuselec: 0.43812495 hartree
