program: Orca
programVersion: 5.0.3
elementType: O O C C C C C C C C C C C C C C C C C C C C C H H H H H H H H H H H H H H H H H H H H H H H H H H H H H H H H Ag
elementType: Ag
charge: 1
multiplicity: 1
keywords: wB97X-D3 TightOpt Freq def2-TZVPP def2/J RIJCOSX TIGHTSCF defgrid3 CHELPG
frequency: 0.00 0.00 0.00 0.00 0.00 0.00 15.72 21.31 30.65 34.76 39.82 48.50 62.61 72.23 77.96 80.96 98.30 117.73 122.39 127.99 140.86 154.94 167.52 184.45 217.84 231.22 232.82 234.03 238.41 253.20 261.98 290.55 302.52 309.48 324.57 338.93 361.66 371.26 394.00 399.22 410.22 433.35 436.75 480.32 499.33 513.25 528.97 537.17 555.11 579.80 596.36 619.51 637.79 703.18 740.71 747.85 765.87 778.15 790.90 804.87 856.24 871.34 878.58 881.97 887.43 889.01 922.98 935.92 966.87 974.76 989.57 996.39 1003.55 1016.37 1027.04 1036.39 1044.20 1056.83 1067.64 1079.13 1102.30 1103.93 1106.34 1127.42 1128.96 1140.76 1169.32 1173.46 1188.00 1206.23 1217.26 1237.27 1246.07 1254.05 1264.44 1272.00 1275.16 1308.40 1318.80 1325.28 1337.95 1342.22 1352.27 1353.29 1360.31 1377.54 1390.91 1394.55 1402.73 1410.09 1418.73 1427.41 1428.34 1434.81 1436.16 1475.60 1477.25 1482.72 1486.91 1490.03 1491.62 1492.14 1493.91 1497.37 1498.93 1500.12 1506.06 1506.17 1509.79 1511.78 1515.33 1566.02 1654.26 1659.75 1687.98 1719.33 3029.46 3038.56 3045.10 3057.45 3057.65 3063.95 3064.70 3065.93 3069.08 3072.24 3073.34 3074.62 3094.82 3110.43 3115.43 3119.38 3124.40 3126.28 3126.97 3129.57 3130.44 3139.00 3141.03 3148.76 3153.73 3169.04 3176.14 3187.91 3188.66 3190.25 3897.34 3897.94
frequency: 15.72 21.31 30.65 34.76 39.82 48.50 62.61 72.23 77.96 80.96 98.30 117.73 122.39 127.99 140.86 154.94 167.52 184.45 217.84 231.22 232.82 234.03 238.41 253.20 261.98 290.55 302.52 309.48 324.57 338.93 361.66 371.26 394.00 399.22 410.22 433.35 436.75 480.32 499.33 513.25 528.97 537.17 555.11 579.80 596.36 619.51 637.79 703.18 740.71 747.85 765.87 778.15 790.90 804.87 856.24 871.34 878.58 881.97 887.43 889.01 922.98 935.92 966.87 974.76 989.57 996.39 1003.55 1016.37 1027.04 1036.39 1044.20 1056.83 1067.64 1079.13 1102.30 1103.93 1106.34 1127.42 1128.96 1140.76 1169.32 1173.46 1188.00 1206.23 1217.26 1237.27 1246.07 1254.05 1264.44 1272.00 1275.16 1308.40 1318.80 1325.28 1337.95 1342.22 1352.27 1353.29 1360.31 1377.54 1390.91 1394.55 1402.73 1410.09 1418.73 1427.41 1428.34 1434.81 1436.16 1475.60 1477.25 1482.72 1486.91 1490.03 1491.62 1492.14 1493.91 1497.37 1498.93 1500.12 1506.06 1506.17 1509.79 1511.78 1515.33 1566.02 1654.26 1659.75 1687.98 1719.33 3029.46 3038.56 3045.10 3057.45 3057.65 3063.95 3064.70 3065.93 3069.08 3072.24 3073.34 3074.62 3094.82 3110.43 3115.43 3119.38 3124.40 3126.28 3126.97 3129.57 3130.44 3139.00 3141.03 3148.76 3153.73 3169.04 3176.14 3187.91 3188.66 3190.25 3897.34 3897.94
formula: C21H32O2Ag
InChI: InChI=1S/C21H32O2.Ag/c1-5-6-7-11-18-14-20(22)19(21(23)15-18)13-12-17(4)10-8-9-16(2)3;/h9,12,14-15,22-23H,5-8,10-11,13H2,1-4H3;
56 atoms
O  -0.109681 1.875321 -2.531895
O  -0.711817 2.564698 2.069297
C  -3.339017 -1.888416 0.03486
C  -3.794293 -0.456546 -0.274712
C  -4.461499 -2.92112 -0.021469
C  -2.636014 0.500577 -0.264707
C  -5.545042 -2.738771 1.037033
C  -0.347146 2.174423 -0.210221
C  0.823259 3.144838 -0.178858
C  -1.912299 0.743122 -1.425388
C  -2.231261 1.100635 0.922081
C  -0.797849 1.57666 -1.405291
C  -1.115787 1.928415 0.947294
C  3.063007 1.897977 -0.200407
C  4.108577 1.136554 0.581487
C  2.030882 2.474988 0.438654
C  4.047042 -0.38793 0.361424
C  -6.586852 -3.849144 1.001549
C  3.284715 1.965958 -1.684894
C  2.831778 -1.057041 0.953041
C  2.059346 -2.036754 0.39889
C  1.119335 -2.849165 1.254058
C  2.260639 -2.569961 -0.99423
H  -2.557026 -2.165085 -0.679747
H  -2.873458 -1.906543 1.026568
H  -4.281936 -0.435674 -1.251857
H  -4.536007 -0.133782 0.456929
H  -4.022712 -3.916517 0.092057
H  -4.918377 -2.905824 -1.016522
H  -6.044746 -1.775867 0.900882
H  -5.077834 -2.704644 2.026802
H  0.545565 4.012766 0.418461
H  1.026499 3.492096 -1.187731
H  -2.228394 0.298068 -2.362475
H  -2.795908 0.934683 1.832912
H  4.006576 1.352536 1.646986
H  5.101129 1.480334 0.282392
H  2.02303 2.437643 1.525819
H  4.91755 -0.837087 0.847984
H  4.148136 -0.619329 -0.698417
H  -7.352544 -3.701238 1.762833
H  -7.086842 -3.887664 0.032016
H  -6.128991 -4.824604 1.175746
H  2.444753 2.390746 -2.226619
H  3.487604 0.978988 -2.105173
H  4.168738 2.574855 -1.8874
H  2.693777 -0.880701 2.019581
H  -0.549572 1.504488 -3.298536
H  -1.33508 2.41713 2.782523
H  0.969752 -2.41009 2.239493
H  1.543473 -3.846869 1.391888
H  0.149278 -2.984778 0.774552
H  2.80452 -1.890923 -1.64654
H  1.305407 -2.811138 -1.460788
H  2.827082 -3.502845 -0.93719
Ag 0.98136 0.142571 0.217627
totalener: -1116.88426055 hartree
nucrepener: 2431.74646040 hartree
electener: -3548.63072096 hartree
oneelecener: -6390.05333469 hartree
twoeener: 2841.42261373 hartree
kineticenergy: 1021.68499811 hartree
xcener: -107.335476257731 hartree
chargesum: 1.0000000
charge: -0.289082 -0.284772 -0.138240 -0.098998 -0.127730 -0.002984 -0.092203 0.002436 -0.186069 -0.203345 -0.208856 0.240915 0.284837 0.013801 -0.138467 -0.155818 -0.198430 -0.255477 -0.244633 -0.125581 0.046694 -0.203403 -0.213715 0.076589 0.069687 0.093107 0.094773 0.071584 0.068298 0.058118 0.058433 0.130321 0.127917 0.094057 0.096382 0.098744 0.113422 0.165998 0.117735 0.108350 0.092573 0.078780 0.076939 0.095666 0.092187 0.127370 0.169937 0.196298 0.196444 0.091675 0.128430 0.091092 0.090290 0.099746 0.133021 0.175158
charge: 0.377747 0.382571 -0.027836 -0.001666 -0.032093 -0.058552 -0.046489 -0.086683 0.009667 -0.018895 -0.017159 -0.186938 -0.185136 -0.073704 0.001791 -0.007287 -0.007674 0.003855 0.033339 -0.022130 -0.094319 0.033327 0.035715 0.018161 0.019522 0.033999 0.030722 0.023011 0.022640 0.013622 0.016088 0.042317 0.035287 0.026247 0.026819 0.036673 0.038166 0.034632 0.041724 0.026047 0.013136 0.012940 0.011958 0.019736 0.021668 0.034581 0.042646 -0.098482 -0.097255 0.028309 0.035969 0.026384 0.020652 0.029824 0.038167 0.362640
qa: -0.2891 -0.2848 -0.1382 -0.0990 -0.1277 -0.0030 -0.0922 0.0024 -0.1861 -0.2033 -0.2089 0.2409 0.2848 0.0138 -0.1385 -0.1558 -0.1984 -0.2555 -0.2446 -0.1256 0.0467 -0.2034 -0.2137 0.0766 0.0697 0.0931 0.0948 0.0716 0.0683 0.0581 0.0584 0.1303 0.1279 0.0941 0.0964 0.0987 0.1134 0.1660 0.1177 0.1083 0.0926 0.0788 0.0769 0.0957 0.0922 0.1274 0.1699 0.1963 0.1964 0.0917 0.1284 0.0911 0.0903 0.0997 0.1330 0.1752
va: 2.1938 2.2022 3.8677 3.8216 3.8988 3.8311 3.8762 3.5568 3.9765 3.9891 3.9891 3.8973 3.9011 3.5838 3.9277 3.6854 3.9644 3.9675 3.9654 3.6969 3.7554 3.9393 3.9335 1.0146 1.0115 1.0115 1.0109 1.0142 1.0102 1.0090 1.0037 1.0183 1.0075 1.0252 1.0240 1.0116 1.0074 1.0207 1.0071 0.9972 1.0062 1.0026 1.0035 1.0234 1.0009 1.0002 1.0223 1.0440 1.0426 1.0086 0.9982 1.0031 1.0125 1.0067 0.9970 1.5998
dispcorr: -0.030643521 hartree
energy: -1116.924579858319
dipole: -82.15663 83.10780 0.95117 -29.00563 28.46413 -0.54150 -9.16984 9.11178 -0.05806
magnitude: 1.09605 au
magnitude: 2.78593 debye
temp: 298.15 k
press: 1.00 atm
zeropoint: 0.49262538 hartree
thermalvibcorrection: 0.02533975 hartree
thermalrotcorrection: 0.00141627 hartree
thermaltrasncorrection: 0.00141627 hartree
thermaltotal: -1116.40378218 hartree
thermalcorr: 0.02817230 hartree
nonthermalcorr: 0.49262538 hartree
totalcorr: 0.52079768 hartree
thermalcorrenthalpy: 0.00094421 hartree
totalenthalpy: -1116.40283797 hartree
totalentropycorr: -0.08386966 hartree
gibbsenthalpy: -1116.48670763 hartree
gibbsminuselec: 0.43787223 hartree
